abdera-dev mailing list archives

Site index · List index
Message view « Date » · « Thread »
Top « Date » · « Thread »
From Apache Jenkins Server <jenk...@builds.apache.org>
Subject Build failed in Jenkins: Abdera2-trunk #777
Date Tue, 19 Nov 2013 17:09:53 GMT
See <https://builds.apache.org/job/Abdera2-trunk/777/>

------------------------------------------
[...truncated 835 lines...]
[WARNING] Failed to getClass for org.apache.maven.plugin.source.SourceJarMojo
[INFO] 
[INFO] --- maven-source-plugin:2.1.2:jar (attach-sources) @ abdera2-test ---
[INFO] META-INF already added, skipping
[INFO] META-INF/NOTICE already added, skipping
[INFO] META-INF/LICENSE already added, skipping
[INFO] Building jar: <https://builds.apache.org/job/Abdera2-trunk/ws/abdera2/test/target/abdera2-test-2.0-SNAPSHOT-sources.jar>
[INFO] META-INF already added, skipping
[INFO] META-INF/NOTICE already added, skipping
[INFO] META-INF/LICENSE already added, skipping
[INFO] 
[INFO] --- maven-install-plugin:2.5.1:install (default-install) @ abdera2-test ---
[INFO] Installing <https://builds.apache.org/job/Abdera2-trunk/ws/abdera2/test/target/abdera2-test-2.0-SNAPSHOT.jar>
to /home/jenkins/jenkins-slave/maven-repositories/1/org/apache/abdera2/abdera2-test/2.0-SNAPSHOT/abdera2-test-2.0-SNAPSHOT.jar
[INFO] Installing <https://builds.apache.org/job/Abdera2-trunk/ws/abdera2/test/pom.xml>
to /home/jenkins/jenkins-slave/maven-repositories/1/org/apache/abdera2/abdera2-test/2.0-SNAPSHOT/abdera2-test-2.0-SNAPSHOT.pom
[INFO] Installing <https://builds.apache.org/job/Abdera2-trunk/ws/abdera2/test/target/abdera2-test-2.0-SNAPSHOT-sources.jar>
to /home/jenkins/jenkins-slave/maven-repositories/1/org/apache/abdera2/abdera2-test/2.0-SNAPSHOT/abdera2-test-2.0-SNAPSHOT-sources.jar
[INFO] 
[INFO] --- maven-bundle-plugin:2.1.0:install (default-install) @ abdera2-test ---
[WARNING] Exception while updating local OBR: Unable to read repository xml: file:/home/jenkins/jenkins-slave/maven-repositories/1/repository.xml
org.apache.maven.plugin.MojoExecutionException: Unable to read repository xml: file:/home/jenkins/jenkins-slave/maven-repositories/1/repository.xml
	at org.apache.felix.obrplugin.ObrUpdate.parseRepositoryXml(ObrUpdate.java:295)
	at org.apache.felix.obrplugin.ObrInstall.execute(ObrInstall.java:140)
	at org.apache.maven.plugin.DefaultBuildPluginManager.executeMojo(DefaultBuildPluginManager.java:101)
	at org.apache.maven.lifecycle.internal.MojoExecutor.execute(MojoExecutor.java:209)
	at org.apache.maven.lifecycle.internal.MojoExecutor.execute(MojoExecutor.java:153)
	at org.apache.maven.lifecycle.internal.MojoExecutor.execute(MojoExecutor.java:145)
	at org.apache.maven.lifecycle.internal.LifecycleModuleBuilder.buildProject(LifecycleModuleBuilder.java:84)
	at org.apache.maven.lifecycle.internal.LifecycleModuleBuilder.buildProject(LifecycleModuleBuilder.java:59)
	at org.apache.maven.lifecycle.internal.LifecycleStarter.singleThreadedBuild(LifecycleStarter.java:183)
	at org.apache.maven.lifecycle.internal.LifecycleStarter.execute(LifecycleStarter.java:161)
	at org.apache.maven.DefaultMaven.doExecute(DefaultMaven.java:320)
	at org.apache.maven.DefaultMaven.execute(DefaultMaven.java:156)
	at org.jvnet.hudson.maven3.launcher.Maven3Launcher.main(Maven3Launcher.java:117)
	at sun.reflect.NativeMethodAccessorImpl.invoke0(Native Method)
	at sun.reflect.NativeMethodAccessorImpl.invoke(NativeMethodAccessorImpl.java:39)
	at sun.reflect.DelegatingMethodAccessorImpl.invoke(DelegatingMethodAccessorImpl.java:25)
	at java.lang.reflect.Method.invoke(Method.java:597)
	at org.codehaus.plexus.classworlds.launcher.Launcher.launchStandard(Launcher.java:329)
	at org.codehaus.plexus.classworlds.launcher.Launcher.launch(Launcher.java:239)
	at org.jvnet.hudson.maven3.agent.Maven3Main.launch(Maven3Main.java:178)
	at sun.reflect.NativeMethodAccessorImpl.invoke0(Native Method)
	at sun.reflect.NativeMethodAccessorImpl.invoke(NativeMethodAccessorImpl.java:39)
	at sun.reflect.DelegatingMethodAccessorImpl.invoke(DelegatingMethodAccessorImpl.java:25)
	at java.lang.reflect.Method.invoke(Method.java:597)
	at hudson.maven.Maven3Builder.call(Maven3Builder.java:134)
	at hudson.maven.Maven3Builder.call(Maven3Builder.java:69)
	at hudson.remoting.UserRequest.perform(UserRequest.java:118)
	at hudson.remoting.UserRequest.perform(UserRequest.java:48)
	at hudson.remoting.Request$2.run(Request.java:328)
	at hudson.remoting.InterceptingExecutorService$1.call(InterceptingExecutorService.java:72)
	at java.util.concurrent.FutureTask$Sync.innerRun(FutureTask.java:303)
	at java.util.concurrent.FutureTask.run(FutureTask.java:138)
	at java.util.concurrent.ThreadPoolExecutor$Worker.runTask(ThreadPoolExecutor.java:895)
	at java.util.concurrent.ThreadPoolExecutor$Worker.run(ThreadPoolExecutor.java:918)
	at java.lang.Thread.run(Thread.java:662)
Caused by: org.xmlpull.v1.XmlPullParserException: unexpected type (position:END_DOCUMENT null@3:1
in java.io.InputStreamReader@1c74e4e) 
	at org.kxml2.io.KXmlParser.exception(Unknown Source)
	at org.kxml2.io.KXmlParser.nextTag(Unknown Source)
	at org.apache.felix.bundlerepository.impl.PullParser.parseRepository(PullParser.java:43)
	at org.apache.felix.bundlerepository.impl.DataModelHelperImpl.repository(DataModelHelperImpl.java:147)
	at org.apache.felix.bundlerepository.impl.DataModelHelperImpl.repository(DataModelHelperImpl.java:118)
	at org.apache.felix.obrplugin.ObrUpdate.parseRepositoryXml(ObrUpdate.java:291)
	... 34 more
[INFO]                                                                         
[INFO] ------------------------------------------------------------------------
[INFO] Building Abdera2 Examples 2.0-SNAPSHOT
[INFO] ------------------------------------------------------------------------
[INFO] 
[INFO] --- maven-clean-plugin:2.4.1:clean (default-clean) @ abdera2-examples ---
[INFO] Deleting <https://builds.apache.org/job/Abdera2-trunk/ws/abdera2/examples/target>
[INFO] 
[INFO] --- cobertura-maven-plugin:2.4:clean (default) @ abdera2-examples ---
[INFO] 
[INFO] --- maven-bundle-plugin:2.1.0:cleanVersions (default) @ abdera2-examples ---
[INFO] 
[INFO] --- maven-remote-resources-plugin:1.0:process (compile) @ abdera2-examples ---
[INFO] 
[INFO] --- maven-resources-plugin:2.5:resources (default-resources) @ abdera2-examples ---
[debug] execute contextualize
[INFO] Using 'UTF-8' encoding to copy filtered resources.
[INFO] Copying 10 resources
[INFO] Copying 2 resources
[INFO] 
[INFO] --- maven-compiler-plugin:2.3.2:compile (default-compile) @ abdera2-examples ---
[INFO] Compiling 45 source files to <https://builds.apache.org/job/Abdera2-trunk/ws/abdera2/examples/target/classes>
[INFO] 
[INFO] --- maven-resources-plugin:2.5:testResources (default-testResources) @ abdera2-examples
---
[debug] execute contextualize
[INFO] Using 'UTF-8' encoding to copy filtered resources.
[INFO] skip non existing resourceDirectory <https://builds.apache.org/job/Abdera2-trunk/ws/abdera2/examples/src/test/resources>
[INFO] Copying 2 resources
[INFO] 
[INFO] --- maven-compiler-plugin:2.3.2:testCompile (default-testCompile) @ abdera2-examples
---
[JENKINS] Recording test results[INFO] No sources to compile
[INFO] 
[INFO] --- maven-surefire-plugin:2.6:test (default-test) @ abdera2-examples ---
[INFO] Surefire report directory: <https://builds.apache.org/job/Abdera2-trunk/ws/abdera2/examples/target/surefire-reports>


-------------------------------------------------------
 T E S T S
-------------------------------------------------------
There are no tests to run.

Results :

Tests run: 0, Failures: 0, Errors: 0, Skipped: 0

[INFO] 
[INFO] --- maven-jar-plugin:2.2:jar (default-jar) @ abdera2-examples ---
[INFO] Building jar: <https://builds.apache.org/job/Abdera2-trunk/ws/abdera2/examples/target/abdera2-examples-2.0-SNAPSHOT.jar>
[INFO] 
[INFO] --- maven-bundle-plugin:2.1.0:cleanVersions (default) @ abdera2-examples ---
[WARNING] Failed to getClass for org.apache.maven.plugin.source.SourceJarMojo
[INFO] 
[INFO] --- maven-source-plugin:2.1.2:jar (attach-sources) @ abdera2-examples ---
[INFO] META-INF already added, skipping
[INFO] org already added, skipping
[INFO] org/apache already added, skipping
[INFO] META-INF already added, skipping
[INFO] META-INF/NOTICE already added, skipping
[INFO] META-INF/LICENSE already added, skipping
[INFO] Building jar: <https://builds.apache.org/job/Abdera2-trunk/ws/abdera2/examples/target/abdera2-examples-2.0-SNAPSHOT-sources.jar>
[INFO] META-INF already added, skipping
[INFO] org already added, skipping
[INFO] org/apache already added, skipping
[INFO] META-INF already added, skipping
[INFO] META-INF/NOTICE already added, skipping
[INFO] META-INF/LICENSE already added, skipping
[INFO] 
[INFO] --- maven-install-plugin:2.3.1:install (default-install) @ abdera2-examples ---
[INFO] Installing <https://builds.apache.org/job/Abdera2-trunk/ws/abdera2/examples/target/abdera2-examples-2.0-SNAPSHOT.jar>
to /home/jenkins/jenkins-slave/maven-repositories/1/org/apache/abdera2/abdera2-examples/2.0-SNAPSHOT/abdera2-examples-2.0-SNAPSHOT.jar
[INFO] Installing <https://builds.apache.org/job/Abdera2-trunk/ws/abdera2/examples/pom.xml>
to /home/jenkins/jenkins-slave/maven-repositories/1/org/apache/abdera2/abdera2-examples/2.0-SNAPSHOT/abdera2-examples-2.0-SNAPSHOT.pom
[INFO] Installing <https://builds.apache.org/job/Abdera2-trunk/ws/abdera2/examples/target/abdera2-examples-2.0-SNAPSHOT-sources.jar>
to /home/jenkins/jenkins-slave/maven-repositories/1/org/apache/abdera2/abdera2-examples/2.0-SNAPSHOT/abdera2-examples-2.0-SNAPSHOT-sources.jar
[INFO] ------------------------------------------------------------------------
[INFO] Reactor Summary:
[INFO] 
[INFO] Apache Abdera2 .................................... SUCCESS [37.840s]
[INFO] Abdera2 Common Library ............................ SUCCESS [27.541s]
[INFO] Abdera2 Core ...................................... SUCCESS [22.730s]
[INFO] Abdera2 Activities ................................ SUCCESS [22.078s]
[INFO] Abdera2 Extensions ................................ SUCCESS [24.073s]
[INFO] Abdera2 Security .................................. SUCCESS [18.845s]
[INFO] Abdera2 Tests ..................................... SUCCESS [59.826s]
[INFO] Abdera2 Examples .................................. SUCCESS [16.682s]
[INFO] ------------------------------------------------------------------------
[INFO] BUILD SUCCESS
[INFO] ------------------------------------------------------------------------
[INFO] Total time: 5:04.241s
[INFO] Finished at: Tue Nov 19 17:09:34 UTC 2013
[INFO] Final Memory: 54M/682M
[INFO] ------------------------------------------------------------------------
Waiting for Jenkins to finish collecting data
[JENKINS] Archiving <https://builds.apache.org/job/Abdera2-trunk/ws/abdera2/core/pom.xml>
to org.apache.abdera2/abdera2-core/2.0-SNAPSHOT/abdera2-core-2.0-SNAPSHOT.pom
[JENKINS] Archiving <https://builds.apache.org/job/Abdera2-trunk/ws/abdera2/core/target/abdera2-core-2.0-SNAPSHOT.jar>
to org.apache.abdera2/abdera2-core/2.0-SNAPSHOT/abdera2-core-2.0-SNAPSHOT.jar
[JENKINS] Archiving <https://builds.apache.org/job/Abdera2-trunk/ws/abdera2/core/target/abdera2-core-2.0-SNAPSHOT-sources.jar>
to org.apache.abdera2/abdera2-core/2.0-SNAPSHOT/abdera2-core-2.0-SNAPSHOT-sources.jar
[JENKINS] Archiving <https://builds.apache.org/job/Abdera2-trunk/ws/abdera2/test/pom.xml>
to org.apache.abdera2/abdera2-test/2.0-SNAPSHOT/abdera2-test-2.0-SNAPSHOT.pom
[JENKINS] Archiving <https://builds.apache.org/job/Abdera2-trunk/ws/abdera2/test/target/abdera2-test-2.0-SNAPSHOT.jar>
to org.apache.abdera2/abdera2-test/2.0-SNAPSHOT/abdera2-test-2.0-SNAPSHOT.jar
[JENKINS] Archiving <https://builds.apache.org/job/Abdera2-trunk/ws/abdera2/test/target/abdera2-test-2.0-SNAPSHOT-sources.jar>
to org.apache.abdera2/abdera2-test/2.0-SNAPSHOT/abdera2-test-2.0-SNAPSHOT-sources.jar
[JENKINS] Archiving <https://builds.apache.org/job/Abdera2-trunk/ws/abdera2/security/pom.xml>
to org.apache.abdera2/abdera2-security/2.0-SNAPSHOT/abdera2-security-2.0-SNAPSHOT.pom
[JENKINS] Archiving <https://builds.apache.org/job/Abdera2-trunk/ws/abdera2/security/target/abdera2-security-2.0-SNAPSHOT.jar>
to org.apache.abdera2/abdera2-security/2.0-SNAPSHOT/abdera2-security-2.0-SNAPSHOT.jar
[JENKINS] Archiving <https://builds.apache.org/job/Abdera2-trunk/ws/abdera2/security/target/abdera2-security-2.0-SNAPSHOT-sources.jar>
to org.apache.abdera2/abdera2-security/2.0-SNAPSHOT/abdera2-security-2.0-SNAPSHOT-sources.jar
[JENKINS] Archiving <https://builds.apache.org/job/Abdera2-trunk/ws/abdera2/examples/pom.xml>
to org.apache.abdera2/abdera2-examples/2.0-SNAPSHOT/abdera2-examples-2.0-SNAPSHOT.pom
[JENKINS] Archiving <https://builds.apache.org/job/Abdera2-trunk/ws/abdera2/examples/target/abdera2-examples-2.0-SNAPSHOT.jar>
to org.apache.abdera2/abdera2-examples/2.0-SNAPSHOT/abdera2-examples-2.0-SNAPSHOT.jar
[JENKINS] Archiving <https://builds.apache.org/job/Abdera2-trunk/ws/abdera2/examples/target/abdera2-examples-2.0-SNAPSHOT-sources.jar>
to org.apache.abdera2/abdera2-examples/2.0-SNAPSHOT/abdera2-examples-2.0-SNAPSHOT-sources.jar
[JENKINS] Archiving <https://builds.apache.org/job/Abdera2-trunk/ws/abdera2/pom.xml>
to org.apache.abdera2/abdera2/2.0-SNAPSHOT/abdera2-2.0-SNAPSHOT.pom
[JENKINS] Archiving <https://builds.apache.org/job/Abdera2-trunk/ws/abdera2/activities/pom.xml>
to org.apache.abdera2/abdera2-activities/2.0-SNAPSHOT/abdera2-activities-2.0-SNAPSHOT.pom
[JENKINS] Archiving <https://builds.apache.org/job/Abdera2-trunk/ws/abdera2/activities/target/abdera2-activities-2.0-SNAPSHOT.jar>
to org.apache.abdera2/abdera2-activities/2.0-SNAPSHOT/abdera2-activities-2.0-SNAPSHOT.jar
[JENKINS] Archiving <https://builds.apache.org/job/Abdera2-trunk/ws/abdera2/activities/target/abdera2-activities-2.0-SNAPSHOT-sources.jar>
to org.apache.abdera2/abdera2-activities/2.0-SNAPSHOT/abdera2-activities-2.0-SNAPSHOT-sources.jar
[JENKINS] Archiving <https://builds.apache.org/job/Abdera2-trunk/ws/abdera2/ext/pom.xml>
to org.apache.abdera2/abdera2-ext/2.0-SNAPSHOT/abdera2-ext-2.0-SNAPSHOT.pom
[JENKINS] Archiving <https://builds.apache.org/job/Abdera2-trunk/ws/abdera2/ext/target/abdera2-ext-2.0-SNAPSHOT.jar>
to org.apache.abdera2/abdera2-ext/2.0-SNAPSHOT/abdera2-ext-2.0-SNAPSHOT.jar
[JENKINS] Archiving <https://builds.apache.org/job/Abdera2-trunk/ws/abdera2/ext/target/abdera2-ext-2.0-SNAPSHOT-sources.jar>
to org.apache.abdera2/abdera2-ext/2.0-SNAPSHOT/abdera2-ext-2.0-SNAPSHOT-sources.jar
[JENKINS] Archiving <https://builds.apache.org/job/Abdera2-trunk/ws/abdera2/common/pom.xml>
to org.apache.abdera2/abdera2-common/2.0-SNAPSHOT/abdera2-common-2.0-SNAPSHOT.pom
[JENKINS] Archiving <https://builds.apache.org/job/Abdera2-trunk/ws/abdera2/common/target/abdera2-common-2.0-SNAPSHOT.jar>
to org.apache.abdera2/abdera2-common/2.0-SNAPSHOT/abdera2-common-2.0-SNAPSHOT.jar
[JENKINS] Archiving <https://builds.apache.org/job/Abdera2-trunk/ws/abdera2/common/target/abdera2-common-2.0-SNAPSHOT-sources.jar>
to org.apache.abdera2/abdera2-common/2.0-SNAPSHOT/abdera2-common-2.0-SNAPSHOT-sources.jar
channel stopped
Maven RedeployPublisher use remote ubuntu3 maven settings from : /home/jenkins/.m2/settings.xml
[ERROR] uniqueVersion == false is not anymore supported in maven 3
[INFO] Deployment in https://repository.apache.org/content/repositories/snapshots (id=apache.snapshots.https,uniqueVersion=false)
Deploying the main artifact jenkins-5834325838750441535abdera2-2.0-SNAPSHOT.pom
Downloading: https://repository.apache.org/content/repositories/snapshots/org/apache/abdera2/abdera2/2.0-SNAPSHOT/maven-metadata.xml
Downloaded: https://repository.apache.org/content/repositories/snapshots/org/apache/abdera2/abdera2/2.0-SNAPSHOT/maven-metadata.xml
(602 B at 0.5 KB/sec)
Uploading: https://repository.apache.org/content/repositories/snapshots/org/apache/abdera2/abdera2/2.0-SNAPSHOT/abdera2-2.0-20131119.170938-627.pom
Uploaded: https://repository.apache.org/content/repositories/snapshots/org/apache/abdera2/abdera2/2.0-SNAPSHOT/abdera2-2.0-20131119.170938-627.pom
(18 KB at 88.1 KB/sec)
Downloading: https://repository.apache.org/content/repositories/snapshots/org/apache/abdera2/abdera2/maven-metadata.xml
Downloaded: https://repository.apache.org/content/repositories/snapshots/org/apache/abdera2/abdera2/maven-metadata.xml
(283 B at 0.1 KB/sec)
Uploading: https://repository.apache.org/content/repositories/snapshots/org/apache/abdera2/abdera2/2.0-SNAPSHOT/maven-metadata.xml
Uploaded: https://repository.apache.org/content/repositories/snapshots/org/apache/abdera2/abdera2/2.0-SNAPSHOT/maven-metadata.xml
(602 B at 2.0 KB/sec)
Uploading: https://repository.apache.org/content/repositories/snapshots/org/apache/abdera2/abdera2/maven-metadata.xml
Uploaded: https://repository.apache.org/content/repositories/snapshots/org/apache/abdera2/abdera2/maven-metadata.xml
(283 B at 2.6 KB/sec)
[ERROR] uniqueVersion == false is not anymore supported in maven 3
[INFO] Deployment in https://repository.apache.org/content/repositories/snapshots (id=apache.snapshots.https,uniqueVersion=false)
Deploying the main artifact jenkins-6370362431859058007abdera2-activities-2.0-SNAPSHOT.jar
Downloading: https://repository.apache.org/content/repositories/snapshots/org/apache/abdera2/abdera2-activities/2.0-SNAPSHOT/maven-metadata.xml
Downloaded: https://repository.apache.org/content/repositories/snapshots/org/apache/abdera2/abdera2-activities/2.0-SNAPSHOT/maven-metadata.xml
(1000 B at 1.3 KB/sec)
Uploading: https://repository.apache.org/content/repositories/snapshots/org/apache/abdera2/abdera2-activities/2.0-SNAPSHOT/abdera2-activities-2.0-20131119.170945-626.jar
Uploading: https://repository.apache.org/content/repositories/snapshots/org/apache/abdera2/abdera2-activities/2.0-SNAPSHOT/abdera2-activities-2.0-20131119.170945-626.pom
Uploaded: https://repository.apache.org/content/repositories/snapshots/org/apache/abdera2/abdera2-activities/2.0-SNAPSHOT/abdera2-activities-2.0-20131119.170945-626.pom
(3 KB at 18.8 KB/sec)
ERROR: Failed to deploy artifacts: Could not transfer artifact org.apache.abdera2:abdera2-activities:jar:2.0-20131119.170945-626
from/to apache.snapshots.https (https://repository.apache.org/content/repositories/snapshots):
The target server failed to respond
org.apache.maven.artifact.deployer.ArtifactDeploymentException: Failed to deploy artifacts:
Could not transfer artifact org.apache.abdera2:abdera2-activities:jar:2.0-20131119.170945-626
from/to apache.snapshots.https (https://repository.apache.org/content/repositories/snapshots):
The target server failed to respond
	at org.apache.maven.artifact.deployer.DefaultArtifactDeployer.deploy(DefaultArtifactDeployer.java:143)
	at hudson.maven.reporters.MavenArtifactRecord.deploy(MavenArtifactRecord.java:191)
	at hudson.maven.RedeployPublisher.perform(RedeployPublisher.java:176)
	at hudson.tasks.BuildStepMonitor$1.perform(BuildStepMonitor.java:20)
	at hudson.model.AbstractBuild$AbstractBuildExecution.perform(AbstractBuild.java:785)
	at hudson.model.AbstractBuild$AbstractBuildExecution.performAllBuildSteps(AbstractBuild.java:757)
	at hudson.maven.MavenModuleSetBuild$MavenModuleSetBuildExecution.post2(MavenModuleSetBuild.java:1020)
	at hudson.model.AbstractBuild$AbstractBuildExecution.post(AbstractBuild.java:706)
	at hudson.model.Run.execute(Run.java:1704)
	at hudson.maven.MavenModuleSetBuild.run(MavenModuleSetBuild.java:509)
	at hudson.model.ResourceController.execute(ResourceController.java:88)
	at hudson.model.Executor.run(Executor.java:230)
Caused by: org.eclipse.aether.deployment.DeploymentException: Failed to deploy artifacts:
Could not transfer artifact org.apache.abdera2:abdera2-activities:jar:2.0-20131119.170945-626
from/to apache.snapshots.https (https://repository.apache.org/content/repositories/snapshots):
The target server failed to respond
	at org.eclipse.aether.internal.impl.DefaultDeployer.deploy(DefaultDeployer.java:341)
	at org.eclipse.aether.internal.impl.DefaultDeployer.deploy(DefaultDeployer.java:269)
	at org.eclipse.aether.internal.impl.DefaultRepositorySystem.deploy(DefaultRepositorySystem.java:413)
	at org.apache.maven.artifact.deployer.DefaultArtifactDeployer.deploy(DefaultArtifactDeployer.java:139)
	... 11 more
Caused by: org.eclipse.aether.transfer.ArtifactTransferException: Could not transfer artifact
org.apache.abdera2:abdera2-activities:jar:2.0-20131119.170945-626 from/to apache.snapshots.https
(https://repository.apache.org/content/repositories/snapshots): The target server failed to
respond
	at org.eclipse.aether.connector.wagon.WagonRepositoryConnector$6.wrap(WagonRepositoryConnector.java:1016)
	at org.eclipse.aether.connector.wagon.WagonRepositoryConnector$6.wrap(WagonRepositoryConnector.java:1004)
	at org.eclipse.aether.connector.wagon.WagonRepositoryConnector$PutTask.run(WagonRepositoryConnector.java:895)
	at org.eclipse.aether.connector.wagon.WagonRepositoryConnector.put(WagonRepositoryConnector.java:522)
	at org.eclipse.aether.internal.impl.DefaultDeployer.deploy(DefaultDeployer.java:335)
	... 14 more
Caused by: org.apache.maven.wagon.TransferFailedException: The target server failed to respond
	at org.apache.maven.wagon.shared.http4.AbstractHttpClientWagon.put(AbstractHttpClientWagon.java:580)
	at org.apache.maven.wagon.shared.http4.AbstractHttpClientWagon.put(AbstractHttpClientWagon.java:524)
	at org.apache.maven.wagon.shared.http4.AbstractHttpClientWagon.put(AbstractHttpClientWagon.java:505)
	at org.apache.maven.wagon.shared.http4.AbstractHttpClientWagon.put(AbstractHttpClientWagon.java:485)
	at org.eclipse.aether.connector.wagon.WagonRepositoryConnector$PutTask.run(WagonRepositoryConnector.java:871)
	... 16 more
Caused by: org.apache.http.NoHttpResponseException: The target server failed to respond
	at org.apache.http.impl.conn.DefaultHttpResponseParser.parseHead(DefaultHttpResponseParser.java:95)
	at org.apache.http.impl.conn.DefaultHttpResponseParser.parseHead(DefaultHttpResponseParser.java:62)
	at org.apache.http.impl.io.AbstractMessageParser.parse(AbstractMessageParser.java:254)
	at org.apache.http.impl.AbstractHttpClientConnection.receiveResponseHeader(AbstractHttpClientConnection.java:289)
	at org.apache.http.impl.conn.DefaultClientConnection.receiveResponseHeader(DefaultClientConnection.java:252)
	at org.apache.http.impl.conn.ManagedClientConnectionImpl.receiveResponseHeader(ManagedClientConnectionImpl.java:191)
	at org.apache.http.protocol.HttpRequestExecutor.doReceiveResponse(HttpRequestExecutor.java:300)
	at org.apache.http.protocol.HttpRequestExecutor.execute(HttpRequestExecutor.java:127)
	at org.apache.http.impl.client.DefaultRequestDirector.tryExecute(DefaultRequestDirector.java:715)
	at org.apache.http.impl.client.DefaultRequestDirector.execute(DefaultRequestDirector.java:520)
	at org.apache.http.impl.client.AbstractHttpClient.execute(AbstractHttpClient.java:906)
	at org.apache.http.impl.client.AbstractHttpClient.execute(AbstractHttpClient.java:805)
	at org.apache.maven.wagon.shared.http4.AbstractHttpClientWagon.execute(AbstractHttpClientWagon.java:746)
	at org.apache.maven.wagon.shared.http4.AbstractHttpClientWagon.put(AbstractHttpClientWagon.java:574)
	... 20 more
[INFO] Deployment failed after 15 sec
Build step 'Deploy artifacts to Maven repository' changed build result to FAILURE

Mime
View raw message