abdera-dev mailing list archives

Site index · List index
Message view « Date » · « Thread »
Top « Date » · « Thread »
From Apache Jenkins Server <jenk...@builds.apache.org>
Subject Build failed in Jenkins: Abdera2-trunk #575
Date Sat, 20 Apr 2013 10:44:30 GMT
See <https://builds.apache.org/job/Abdera2-trunk/575/>

------------------------------------------
[...truncated 207 lines...]
[INFO] 
[INFO] --- maven-bundle-plugin:2.1.0:bundle (default-bundle) @ abdera2-core ---
[WARNING] Warning building bundle org.apache.abdera2:abdera2-core:bundle:2.0-SNAPSHOT : Instructions
in Export-Package that are never used: org\.apache\.abdera2\.parser\.axiom\..*|org\.apache\.abdera2\.parser\.axiom,
org\.apache\.abdera2\.parser\.filter\..*|org\.apache\.abdera2\.parser\.filter, org\.apache\.abdera2\.model\.selector\..*|org\.apache\.abdera2\.model\.selector
[WARNING] Warning building bundle org.apache.abdera2:abdera2-core:bundle:2.0-SNAPSHOT : Superfluous
export-package instructions: [org.apache.abdera2.model.selector.*, org.apache.abdera2.parser.filter.*,
org.apache.abdera2.parser.axiom.*]
[INFO] 
[INFO] --- maven-bundle-plugin:2.1.0:cleanVersions (default) @ abdera2-core ---
Apr 20, 2013 10:44:06 AM hudson.maven.ExecutedMojo <init>
WARNING: Failed to getClass for org.apache.maven.plugin.source.SourceJarMojo
[INFO] 
[INFO] --- maven-source-plugin:2.1.2:jar (attach-sources) @ abdera2-core ---
[INFO] META-INF already added, skipping
[INFO] META-INF already added, skipping
[INFO] META-INF/NOTICE already added, skipping
[INFO] META-INF/LICENSE already added, skipping
[INFO] Building jar: <https://builds.apache.org/job/Abdera2-trunk/ws/abdera2/core/target/abdera2-core-2.0-SNAPSHOT-sources.jar>
[INFO] META-INF already added, skipping
[INFO] META-INF already added, skipping
[INFO] META-INF/NOTICE already added, skipping
[INFO] META-INF/LICENSE already added, skipping
[INFO] [INFO] Installing <https://builds.apache.org/job/Abdera2-trunk/ws/abdera2/core/target/abdera2-core-2.0-SNAPSHOT.jar>
to /home/jenkins/jenkins-slave/maven-repositories/0/org/apache/abdera2/abdera2-core/2.0-SNAPSHOT/abdera2-core-2.0-SNAPSHOT.jar

[INFO] --- maven-install-plugin:2.4:install (default-install) @ abdera2-core ---
[INFO] Installing <https://builds.apache.org/job/Abdera2-trunk/ws/abdera2/core/pom.xml>
to /home/jenkins/jenkins-slave/maven-repositories/0/org/apache/abdera2/abdera2-core/2.0-SNAPSHOT/abdera2-core-2.0-SNAPSHOT.pom
[INFO] Installing <https://builds.apache.org/job/Abdera2-trunk/ws/abdera2/core/target/abdera2-core-2.0-SNAPSHOT-sources.jar>
to /home/jenkins/jenkins-slave/maven-repositories/0/org/apache/abdera2/abdera2-core/2.0-SNAPSHOT/abdera2-core-2.0-SNAPSHOT-sources.jar
[INFO] [WARNING] Exception while updating local OBR: Unable to read repository xml: file:/home/jenkins/jenkins-slave/maven-repositories/0/repository.xml
org.apache.maven.plugin.MojoExecutionException: Unable to read repository xml: file:/home/jenkins/jenkins-slave/maven-repositories/0/repository.xml
	at org.apache.felix.obrplugin.ObrUpdate.parseRepositoryXml(ObrUpdate.java:295)
	at org.apache.felix.obrplugin.ObrInstall.execute(ObrInstall.java:140)
	at org.apache.maven.plugin.DefaultBuildPluginManager.executeMojo(DefaultBuildPluginManager.java:101)
	at org.apache.maven.lifecycle.internal.MojoExecutor.execute(MojoExecutor.java:209)
	at org.apache.maven.lifecycle.internal.MojoExecutor.execute(MojoExecutor.java:153)
	at org.apache.maven.lifecycle.internal.MojoExecutor.execute(MojoExecutor.java:145)
	at org.apache.maven.lifecycle.internal.LifecycleModuleBuilder.buildProject(LifecycleModuleBuilder.java:84)
	at org.apache.maven.lifecycle.internal.LifecycleModuleBuilder.buildProject(LifecycleModuleBuilder.java:59)
	at org.apache.maven.lifecycle.internal.LifecycleStarter.singleThreadedBuild(LifecycleStarter.java:183)
	at org.apache.maven.lifecycle.internal.LifecycleStarter.execute(LifecycleStarter.java:161)
	at org.apache.maven.DefaultMaven.doExecute(DefaultMaven.java:320)
	at org.apache.maven.DefaultMaven.execute(DefaultMaven.java:156)
	at org.jvnet.hudson.maven3.launcher.Maven3Launcher.main(Maven3Launcher.java:79)
	at sun.reflect.NativeMethodAccessorImpl.invoke0(Native Method)
	at sun.reflect.NativeMethodAccessorImpl.invoke(NativeMethodAccessorImpl.java:39)
	at sun.reflect.DelegatingMethodAccessorImpl.invoke(DelegatingMethodAccessorImpl.java:25)
	at java.lang.reflect.Method.invoke(Method.java:597)
	at org.codehaus.plexus.classworlds.launcher.Launcher.launchStandard(Launcher.java:329)
	at org.codehaus.plexus.classworlds.launcher.Launcher.launch(Launcher.java:239)
	at org.jvnet.hudson.maven3.agent.Maven3Main.launch(Maven3Main.java:158)
	at hudson.maven.Maven3Builder.call(Maven3Builder.java:100)
	at hudson.maven.Maven3Builder.call(Maven3Builder.java:66)
	at hudson.remoting.UserRequest.perform(UserRequest.java:118)
	at hudson.remoting.UserRequest.perform(UserRequest.java:48)
	at hudson.remoting.Request$2.run(Request.java:326)
	at hudson.remoting.InterceptingExecutorService$1.call(InterceptingExecutorService.java:72)
	at java.util.concurrent.FutureTask$Sync.innerRun(FutureTask.java:303)
	at java.util.concurrent.FutureTask.run(FutureTask.java:138)
	at java.util.concurrent.ThreadPoolExecutor$Worker.runTask(ThreadPoolExecutor.java:886)
	at java.util.concurrent.ThreadPoolExecutor$Worker.run(ThreadPoolExecutor.java:908)
	at java.lang.Thread.run(Thread.java:662)
Caused by: org.xmlpull.v1.XmlPullParserException: unexpected type (position:END_DOCUMENT null@3:1
in java.io.InputStreamReader@164379e) 
	at org.kxml2.io.KXmlParser.exception(Unknown Source)
	at org.kxml2.io.KXmlParser.nextTag(Unknown Source)
	at org.apache.felix.bundlerepository.impl.PullParser.parseRepository(PullParser.java:43)
	at org.apache.felix.bundlerepository.impl.DataModelHelperImpl.repository(DataModelHelperImpl.java:147)
	at org.apache.felix.bundlerepository.impl.DataModelHelperImpl.repository(DataModelHelperImpl.java:118)
	at org.apache.felix.obrplugin.ObrUpdate.parseRepositoryXml(ObrUpdate.java:291)
	... 30 more

[INFO] --- maven-bundle-plugin:2.1.0:install (default-install) @ abdera2-core ---
[INFO]                                                                         
[INFO] ------------------------------------------------------------------------
[INFO] Building Abdera2 Activities 2.0-SNAPSHOT
[INFO] ------------------------------------------------------------------------
[INFO] [INFO] Deleting <https://builds.apache.org/job/Abdera2-trunk/ws/abdera2/activities/target>

[INFO] --- maven-clean-plugin:2.4.1:clean (default-clean) @ abdera2-activities ---
[INFO] 
[INFO] --- cobertura-maven-plugin:2.4:clean (default) @ abdera2-activities ---
[INFO] 
[INFO] --- maven-bundle-plugin:2.1.0:cleanVersions (default) @ abdera2-activities ---
[INFO] 
[INFO] --- maven-remote-resources-plugin:1.0:process (compile) @ abdera2-activities ---
[INFO] Using 'UTF-8' encoding to copy filtered resources.
[INFO] [INFO] Copying 0 resource
[INFO] Copying 2 resources

[INFO] --- maven-resources-plugin:2.6:resources (default-resources) @ abdera2-activities ---
[INFO] 
[INFO] --- maven-compiler-plugin:2.3.2:compile (default-compile) @ abdera2-activities ---
[INFO] Compiling 81 source files to <https://builds.apache.org/job/Abdera2-trunk/ws/abdera2/activities/target/classes>
[INFO] Using 'UTF-8' encoding to copy filtered resources.
[INFO] [INFO] skip non existing resourceDirectory <https://builds.apache.org/job/Abdera2-trunk/ws/abdera2/activities/src/test/resources>
[INFO] Copying 2 resources

[INFO] --- maven-resources-plugin:2.6:testResources (default-testResources) @ abdera2-activities
---
[INFO] [INFO] No sources to compile

[INFO] --- maven-compiler-plugin:2.3.2:testCompile (default-testCompile) @ abdera2-activities
---
[INFO] [INFO] Surefire report directory: <https://builds.apache.org/job/Abdera2-trunk/ws/abdera2/activities/target/surefire-reports>

[INFO] --- maven-surefire-plugin:2.6:test (default-test) @ abdera2-activities ---

-------------------------------------------------------
 T E S T S
-------------------------------------------------------
There are no tests to run.

Results :

Tests run: 0, Failures: 0, Errors: 0, Skipped: 0

[JENKINS] Recording test results
[INFO] 
[INFO] --- maven-bundle-plugin:2.1.0:bundle (default-bundle) @ abdera2-activities ---
[INFO] 
[INFO] --- maven-bundle-plugin:2.1.0:cleanVersions (default) @ abdera2-activities ---
Apr 20, 2013 10:44:15 AM hudson.maven.ExecutedMojo <init>
WARNING: Failed to getClass for org.apache.maven.plugin.source.SourceJarMojo
[INFO] 
[INFO] --- maven-source-plugin:2.1.2:jar (attach-sources) @ abdera2-activities ---
[INFO] META-INF already added, skipping
[INFO] META-INF/NOTICE already added, skipping
[INFO] META-INF/LICENSE already added, skipping
[INFO] Building jar: <https://builds.apache.org/job/Abdera2-trunk/ws/abdera2/activities/target/abdera2-activities-2.0-SNAPSHOT-sources.jar>
[INFO] META-INF already added, skipping
[INFO] META-INF/NOTICE already added, skipping
[INFO] META-INF/LICENSE already added, skipping
[INFO] [INFO] Installing <https://builds.apache.org/job/Abdera2-trunk/ws/abdera2/activities/target/abdera2-activities-2.0-SNAPSHOT.jar>
to /home/jenkins/jenkins-slave/maven-repositories/0/org/apache/abdera2/abdera2-activities/2.0-SNAPSHOT/abdera2-activities-2.0-SNAPSHOT.jar
[INFO] Installing <https://builds.apache.org/job/Abdera2-trunk/ws/abdera2/activities/pom.xml>
to /home/jenkins/jenkins-slave/maven-repositories/0/org/apache/abdera2/abdera2-activities/2.0-SNAPSHOT/abdera2-activities-2.0-SNAPSHOT.pom
[INFO] Installing <https://builds.apache.org/job/Abdera2-trunk/ws/abdera2/activities/target/abdera2-activities-2.0-SNAPSHOT-sources.jar>
to /home/jenkins/jenkins-slave/maven-repositories/0/org/apache/abdera2/abdera2-activities/2.0-SNAPSHOT/abdera2-activities-2.0-SNAPSHOT-sources.jar

[INFO] --- maven-install-plugin:2.4:install (default-install) @ abdera2-activities ---
[INFO] [WARNING] Exception while updating local OBR: Unable to read repository xml: file:/home/jenkins/jenkins-slave/maven-repositories/0/repository.xml
org.apache.maven.plugin.MojoExecutionException: Unable to read repository xml: file:/home/jenkins/jenkins-slave/maven-repositories/0/repository.xml
	at org.apache.felix.obrplugin.ObrUpdate.parseRepositoryXml(ObrUpdate.java:295)
	at org.apache.felix.obrplugin.ObrInstall.execute(ObrInstall.java:140)
	at org.apache.maven.plugin.DefaultBuildPluginManager.executeMojo(DefaultBuildPluginManager.java:101)
	at org.apache.maven.lifecycle.internal.MojoExecutor.execute(MojoExecutor.java:209)
	at org.apache.maven.lifecycle.internal.MojoExecutor.execute(MojoExecutor.java:153)
	at org.apache.maven.lifecycle.internal.MojoExecutor.execute(MojoExecutor.java:145)
	at org.apache.maven.lifecycle.internal.LifecycleModuleBuilder.buildProject(LifecycleModuleBuilder.java:84)
	at org.apache.maven.lifecycle.internal.LifecycleModuleBuilder.buildProject(LifecycleModuleBuilder.java:59)
	at org.apache.maven.lifecycle.internal.LifecycleStarter.singleThreadedBuild(LifecycleStarter.java:183)
	at org.apache.maven.lifecycle.internal.LifecycleStarter.execute(LifecycleStarter.java:161)
	at org.apache.maven.DefaultMaven.doExecute(DefaultMaven.java:320)
	at org.apache.maven.DefaultMaven.execute(DefaultMaven.java:156)
	at org.jvnet.hudson.maven3.launcher.Maven3Launcher.main(Maven3Launcher.java:79)
	at sun.reflect.NativeMethodAccessorImpl.invoke0(Native Method)
	at sun.reflect.NativeMethodAccessorImpl.invoke(NativeMethodAccessorImpl.java:39)
	at sun.reflect.DelegatingMethodAccessorImpl.invoke(DelegatingMethodAccessorImpl.java:25)
	at java.lang.reflect.Method.invoke(Method.java:597)
	at org.codehaus.plexus.classworlds.launcher.Launcher.launchStandard(Launcher.java:329)
	at org.codehaus.plexus.classworlds.launcher.Launcher.launch(Launcher.java:239)
	at org.jvnet.hudson.maven3.agent.Maven3Main.launch(Maven3Main.java:158)
	at hudson.maven.Maven3Builder.call(Maven3Builder.java:100)
	at hudson.maven.Maven3Builder.call(Maven3Builder.java:66)
	at hudson.remoting.UserRequest.perform(UserRequest.java:118)
	at hudson.remoting.UserRequest.perform(UserRequest.java:48)
	at hudson.remoting.Request$2.run(Request.java:326)
	at hudson.remoting.InterceptingExecutorService$1.call(InterceptingExecutorService.java:72)
	at java.util.concurrent.FutureTask$Sync.innerRun(FutureTask.java:303)
	at java.util.concurrent.FutureTask.run(FutureTask.java:138)
	at java.util.concurrent.ThreadPoolExecutor$Worker.runTask(ThreadPoolExecutor.java:886)
	at java.util.concurrent.ThreadPoolExecutor$Worker.run(ThreadPoolExecutor.java:908)
	at java.lang.Thread.run(Thread.java:662)
Caused by: org.xmlpull.v1.XmlPullParserException: unexpected type (position:END_DOCUMENT null@3:1
in java.io.InputStreamReader@14d75bf) 
	at org.kxml2.io.KXmlParser.exception(Unknown Source)
	at org.kxml2.io.KXmlParser.nextTag(Unknown Source)
	at org.apache.felix.bundlerepository.impl.PullParser.parseRepository(PullParser.java:43)
	at org.apache.felix.bundlerepository.impl.DataModelHelperImpl.repository(DataModelHelperImpl.java:147)
	at org.apache.felix.bundlerepository.impl.DataModelHelperImpl.repository(DataModelHelperImpl.java:118)
	at org.apache.felix.obrplugin.ObrUpdate.parseRepositoryXml(ObrUpdate.java:291)
	... 30 more

[INFO] --- maven-bundle-plugin:2.1.0:install (default-install) @ abdera2-activities ---
[INFO]                                                                         
[INFO] ------------------------------------------------------------------------
[INFO] Building Abdera2 Extensions 2.0-SNAPSHOT
[INFO] ------------------------------------------------------------------------
[INFO] [INFO] Deleting <https://builds.apache.org/job/Abdera2-trunk/ws/abdera2/ext/target>

[INFO] --- maven-clean-plugin:2.4.1:clean (default-clean) @ abdera2-ext ---
[INFO] 
[INFO] --- cobertura-maven-plugin:2.4:clean (default) @ abdera2-ext ---
[INFO] 
[INFO] --- maven-bundle-plugin:2.1.0:cleanVersions (default) @ abdera2-ext ---
[INFO] 
[INFO] --- maven-remote-resources-plugin:1.0:process (compile) @ abdera2-ext ---
[INFO] Using 'UTF-8' encoding to copy filtered resources.
[INFO] [INFO] Copying 4 resources
[INFO] Copying 2 resources

[INFO] --- maven-resources-plugin:2.6:resources (default-resources) @ abdera2-ext ---
[INFO] 
[INFO] --- maven-compiler-plugin:2.3.2:compile (default-compile) @ abdera2-ext ---
[INFO] Compiling 153 source files to <https://builds.apache.org/job/Abdera2-trunk/ws/abdera2/ext/target/classes>
ERROR: Processing failed due to a bug in the code. Please report this to jenkinsci-users@googlegroups.com
hudson.remoting.RequestAbortedException: hudson.remoting.RequestAbortedException: java.io.StreamCorruptedException:
invalid type code: 00
	at hudson.remoting.Request.call(Request.java:174)
	at hudson.remoting.Channel.call(Channel.java:672)
	at hudson.maven.ProcessCache$MavenProcess.call(ProcessCache.java:156)
	at hudson.maven.MavenModuleSetBuild$MavenModuleSetBuildExecution.doRun(MavenModuleSetBuild.java:755)
	at hudson.model.AbstractBuild$AbstractBuildExecution.run(AbstractBuild.java:592)
	at hudson.model.Run.execute(Run.java:1568)
	at hudson.maven.MavenModuleSetBuild.run(MavenModuleSetBuild.java:477)
	at hudson.model.ResourceController.execute(ResourceController.java:88)
	at hudson.model.Executor.run(Executor.java:236)
Caused by: hudson.remoting.RequestAbortedException: java.io.StreamCorruptedException: invalid
type code: 00
	at hudson.remoting.Request.abort(Request.java:299)
	at hudson.remoting.Channel.terminate(Channel.java:732)
	at hudson.slaves.Channels$1.terminate(Channels.java:77)
	at hudson.remoting.SynchronousCommandTransport$ReaderThread.run(SynchronousCommandTransport.java:69)
Caused by: java.io.StreamCorruptedException: invalid type code: 00
	at java.io.ObjectInputStream.readObject0(ObjectInputStream.java:1374)
	at java.io.ObjectInputStream.defaultReadFields(ObjectInputStream.java:1970)
	at java.io.ObjectInputStream.readSerialData(ObjectInputStream.java:1894)
	at java.io.ObjectInputStream.readOrdinaryObject(ObjectInputStream.java:1777)
	at java.io.ObjectInputStream.readObject0(ObjectInputStream.java:1347)
	at java.io.ObjectInputStream.readObject(ObjectInputStream.java:369)
	at hudson.remoting.Command.readFrom(Command.java:92)
	at hudson.remoting.ClassicCommandTransport.read(ClassicCommandTransport.java:59)
	at hudson.remoting.SynchronousCommandTransport$ReaderThread.run(SynchronousCommandTransport.java:48)
project=hudson.maven.MavenModuleSet@239f66da[Abdera2-trunk]
project.getModules()=[hudson.maven.MavenModule@5257738a[Abdera2-trunk/org.apache.abdera2:abdera-examples][Abdera2-trunk/org.apache.abdera2:abdera-examples][relativePath:examples],
hudson.maven.MavenModule@7079e04c[Abdera2-trunk/org.apache.abdera2:abdera2][Abdera2-trunk/org.apache.abdera2:abdera2][relativePath:],
hudson.maven.MavenModule@5174d744[Abdera2-trunk/org.apache.abdera2:abdera2-activities][Abdera2-trunk/org.apache.abdera2:abdera2-activities][relativePath:activities],
hudson.maven.MavenModule@6b629341[Abdera2-trunk/org.apache.abdera2:abdera2-client][Abdera2-trunk/org.apache.abdera2:abdera2-client][relativePath:client],
hudson.maven.MavenModule@4de0db23[Abdera2-trunk/org.apache.abdera2:abdera2-common][Abdera2-trunk/org.apache.abdera2:abdera2-common][relativePath:common],
hudson.maven.MavenModule@6552fec6[Abdera2-trunk/org.apache.abdera2:abdera2-core][Abdera2-trunk/org.apache.abdera2:abdera2-core][relativePath:core],
hudson.maven.MavenModule@2bd4ad22[Abdera2-trunk/org.apache.abdera2:abdera2-examples][Abdera2-trunk/org.apache.abdera2:abdera2-examples][relativePath:examples],
hudson.maven.MavenModule@17b2a9a9[Abdera2-trunk/org.apache.abdera2:abdera2-ext][Abdera2-trunk/org.apache.abdera2:abdera2-ext][relativePath:ext],
hudson.maven.MavenModule@52a0a266[Abdera2-trunk/org.apache.abdera2:abdera2-security][Abdera2-trunk/org.apache.abdera2:abdera2-security][relativePath:security],
hudson.maven.MavenModule@14b1c77b[Abdera2-trunk/org.apache.abdera2:abdera2-server][Abdera2-trunk/org.apache.abdera2:abdera2-server][relativePath:server],
hudson.maven.MavenModule@300600eb[Abdera2-trunk/org.apache.abdera2:abdera2-test][Abdera2-trunk/org.apache.abdera2:abdera2-test][relativePath:test]]
project.getRootModule()=hudson.maven.MavenModule@7079e04c[Abdera2-trunk/org.apache.abdera2:abdera2][Abdera2-trunk/org.apache.abdera2:abdera2][relativePath:]
FATAL: hudson.remoting.RequestAbortedException: java.io.StreamCorruptedException: invalid
type code: 00
hudson.remoting.RequestAbortedException: hudson.remoting.RequestAbortedException: java.io.StreamCorruptedException:
invalid type code: 00
	at hudson.remoting.Request.call(Request.java:174)
	at hudson.remoting.Channel.call(Channel.java:672)
	at hudson.maven.ProcessCache$MavenProcess.call(ProcessCache.java:156)
	at hudson.maven.MavenModuleSetBuild$MavenModuleSetBuildExecution.doRun(MavenModuleSetBuild.java:755)
	at hudson.model.AbstractBuild$AbstractBuildExecution.run(AbstractBuild.java:592)
	at hudson.model.Run.execute(Run.java:1568)
	at hudson.maven.MavenModuleSetBuild.run(MavenModuleSetBuild.java:477)
	at hudson.model.ResourceController.execute(ResourceController.java:88)
	at hudson.model.Executor.run(Executor.java:236)
Caused by: hudson.remoting.RequestAbortedException: java.io.StreamCorruptedException: invalid
type code: 00
	at hudson.remoting.Request.abort(Request.java:299)
	at hudson.remoting.Channel.terminate(Channel.java:732)
	at hudson.slaves.Channels$1.terminate(Channels.java:77)
	at hudson.remoting.SynchronousCommandTransport$ReaderThread.run(SynchronousCommandTransport.java:69)
Caused by: java.io.StreamCorruptedException: invalid type code: 00
	at java.io.ObjectInputStream.readObject0(ObjectInputStream.java:1374)
	at java.io.ObjectInputStream.defaultReadFields(ObjectInputStream.java:1970)
	at java.io.ObjectInputStream.readSerialData(ObjectInputStream.java:1894)
	at java.io.ObjectInputStream.readOrdinaryObject(ObjectInputStream.java:1777)
	at java.io.ObjectInputStream.readObject0(ObjectInputStream.java:1347)
	at java.io.ObjectInputStream.readObject(ObjectInputStream.java:369)
	at hudson.remoting.Command.readFrom(Command.java:92)
	at hudson.remoting.ClassicCommandTransport.read(ClassicCommandTransport.java:59)
	at hudson.remoting.SynchronousCommandTransport$ReaderThread.run(SynchronousCommandTransport.java:48)

Mime
View raw message