abdera-dev mailing list archives

Site index · List index
Message view « Date » · « Thread »
Top « Date » · « Thread »
From Apache Jenkins Server <jenk...@builds.apache.org>
Subject Build failed in Jenkins: Abdera2-trunk #290
Date Sun, 01 Jul 2012 00:05:31 GMT
See <https://builds.apache.org/job/Abdera2-trunk/290/>

------------------------------------------
[...truncated 1713 lines...]
2012-07-01 00:04:39.008:INFO:oejs.Server:jetty-8.0.0.v20110901
2012-07-01 00:04:39.010:INFO:oejs.AbstractConnector:Started SelectChannelConnector@0.0.0.0:9002
STARTING
2012-07-01 00:04:39.176:INFO:oejsh.ContextHandler:stopped o.e.j.s.ServletContextHandler{/,null}
Tests run: 3, Failures: 0, Errors: 0, Skipped: 0, Time elapsed: 0.233 sec
Running org.apache.abdera2.test.common.http.AuthenticationTest
Tests run: 23, Failures: 0, Errors: 0, Skipped: 0, Time elapsed: 0.022 sec
Running org.apache.abdera2.test.parser.axiom.ConcurrencyTest
Tests run: 1, Failures: 0, Errors: 0, Skipped: 0, Time elapsed: 0.7 sec
Running org.apache.abdera2.test.common.lang.LangTest
Tests run: 1, Failures: 0, Errors: 0, Skipped: 0, Time elapsed: 0.004 sec
Running org.apache.abdera2.test.common.templates.TemplateTest
Tests run: 4, Failures: 0, Errors: 0, Skipped: 0, Time elapsed: 0.052 sec
Running org.apache.abdera2.test.parser.axiom.EntryLinkTest
Tests run: 1, Failures: 0, Errors: 0, Skipped: 0, Time elapsed: 0.004 sec
Running org.apache.abdera2.test.parser.axiom.ParserTest
Tests run: 3, Failures: 0, Errors: 0, Skipped: 0, Time elapsed: 0.005 sec
Running org.apache.abdera2.test.common.text.CodecTest
Tests run: 1, Failures: 0, Errors: 0, Skipped: 0, Time elapsed: 0.003 sec

Results :

Tests run: 482, Failures: 0, Errors: 0, Skipped: 0

mojoSucceeded org.apache.maven.plugins:maven-surefire-plugin:2.6(default-test)
[JENKINS] Recording test results
mojoStarted org.apache.felix:maven-bundle-plugin:2.1.0(default-bundle)
[INFO] 
[INFO] --- maven-bundle-plugin:2.1.0:bundle (default-bundle) @ abdera2-test ---
[WARNING] Warning building bundle org.apache.abdera2:abdera2-test:bundle:2.0-SNAPSHOT : Did
not find matching referal for org.apache.abdera2.*
mojoSucceeded org.apache.felix:maven-bundle-plugin:2.1.0(default-bundle)
forkedProjectStarted org.apache.abdera2:abdera2-test:2.0-SNAPSHOT
mojoStarted org.apache.felix:maven-bundle-plugin:2.1.0(default)
[INFO] 
[INFO] --- maven-bundle-plugin:2.1.0:cleanVersions (default) @ abdera2-test ---
mojoSucceeded org.apache.felix:maven-bundle-plugin:2.1.0(default)
Jul 1, 2012 12:04:53 AM hudson.maven.ExecutedMojo <init>
forkedProjectSucceeded org.apache.abdera2:abdera2-test:2.0-SNAPSHOTWARNING: Failed to getClass
for org.apache.maven.plugin.source.SourceJarMojo

mojoStarted org.apache.maven.plugins:maven-source-plugin:2.1.2(attach-sources)
[INFO] 
[INFO] --- maven-source-plugin:2.1.2:jar (attach-sources) @ abdera2-test ---
[INFO] META-INF already added, skipping
[INFO] META-INF/NOTICE already added, skipping
[INFO] META-INF/LICENSE already added, skipping
[INFO] Building jar: <https://builds.apache.org/job/Abdera2-trunk/ws/abdera2/test/target/abdera2-test-2.0-SNAPSHOT-sources.jar>
[INFO] META-INF already added, skipping
[INFO] META-INF/NOTICE already added, skipping
[INFO] META-INF/LICENSE already added, skipping
mojoSucceeded org.apache.maven.plugins:maven-source-plugin:2.1.2(attach-sources)
[INFO] Installing <https://builds.apache.org/job/Abdera2-trunk/ws/abdera2/test/target/abdera2-test-2.0-SNAPSHOT.jar>
to /home/jenkins/jenkins-slave/maven-repositories/1/org/apache/abdera2/abdera2-test/2.0-SNAPSHOT/abdera2-test-2.0-SNAPSHOT.jar
mojoStarted org.apache.maven.plugins:maven-install-plugin:2.3.1(default-install)
[INFO] 
[INFO] --- maven-install-plugin:2.3.1:install (default-install) @ abdera2-test ---
[INFO] Installing <https://builds.apache.org/job/Abdera2-trunk/ws/abdera2/test/pom.xml>
to /home/jenkins/jenkins-slave/maven-repositories/1/org/apache/abdera2/abdera2-test/2.0-SNAPSHOT/abdera2-test-2.0-SNAPSHOT.pom
[INFO] Installing <https://builds.apache.org/job/Abdera2-trunk/ws/abdera2/test/target/abdera2-test-2.0-SNAPSHOT-sources.jar>
to /home/jenkins/jenkins-slave/maven-repositories/1/org/apache/abdera2/abdera2-test/2.0-SNAPSHOT/abdera2-test-2.0-SNAPSHOT-sources.jar
mojoSucceeded org.apache.maven.plugins:maven-install-plugin:2.3.1(default-install)
mojoStarted org.apache.felix:maven-bundle-plugin:2.1.0(default-install)
[INFO] 
[INFO] --- maven-bundle-plugin:2.1.0:install (default-install) @ abdera2-test ---
[INFO] Installing org/apache/abdera2/abdera2-test/2.0-SNAPSHOT/abdera2-test-2.0-SNAPSHOT.jar
[INFO] Writing OBR metadata
mojoSucceeded org.apache.felix:maven-bundle-plugin:2.1.0(default-install)
projectSucceeded org.apache.abdera2:abdera2-test:2.0-SNAPSHOT
projectStarted org.apache.abdera2:abdera2-examples:2.0-SNAPSHOT
[INFO]                                                                         
[INFO] ------------------------------------------------------------------------
[INFO] Building Abdera2 Examples 2.0-SNAPSHOT
[INFO] ------------------------------------------------------------------------
mojoStarted org.apache.maven.plugins:maven-clean-plugin:2.4.1(default-clean)
[INFO] 
[INFO] --- maven-clean-plugin:2.4.1:clean (default-clean) @ abdera2-examples ---
mojoSucceeded org.apache.maven.plugins:maven-clean-plugin:2.4.1(default-clean)
mojoStarted org.codehaus.mojo:cobertura-maven-plugin:2.4(default)
[INFO] 
[INFO] --- cobertura-maven-plugin:2.4:clean (default) @ abdera2-examples ---
mojoSucceeded org.codehaus.mojo:cobertura-maven-plugin:2.4(default)
mojoStarted org.apache.felix:maven-bundle-plugin:2.1.0(default)
[INFO] 
[INFO] --- maven-bundle-plugin:2.1.0:cleanVersions (default) @ abdera2-examples ---
mojoSucceeded org.apache.felix:maven-bundle-plugin:2.1.0(default)
mojoStarted org.apache.maven.plugins:maven-remote-resources-plugin:1.0(compile)
[INFO] 
[INFO] --- maven-remote-resources-plugin:1.0:process (compile) @ abdera2-examples ---
mojoSucceeded org.apache.maven.plugins:maven-remote-resources-plugin:1.0(compile)
mojoStarted org.apache.maven.plugins:maven-resources-plugin:2.4.3(default-resources)
[INFO] 
[INFO] --- maven-resources-plugin:2.4.3:resources (default-resources) @ abdera2-examples ---
[INFO] Using 'UTF-8' encoding to copy filtered resources.
[INFO] Copying 10 resources
[INFO] Copying 2 resources
mojoSucceeded org.apache.maven.plugins:maven-resources-plugin:2.4.3(default-resources)
mojoStarted org.apache.maven.plugins:maven-compiler-plugin:2.3.2(default-compile)
[INFO] 
[INFO] --- maven-compiler-plugin:2.3.2:compile (default-compile) @ abdera2-examples ---
[INFO] Compiling 45 source files to <https://builds.apache.org/job/Abdera2-trunk/ws/abdera2/examples/target/classes>
mojoSucceeded org.apache.maven.plugins:maven-compiler-plugin:2.3.2(default-compile)
mojoStarted org.apache.maven.plugins:maven-resources-plugin:2.4.3(default-testResources)[INFO]
Using 'UTF-8' encoding to copy filtered resources.
[INFO] skip non existing resourceDirectory <https://builds.apache.org/job/Abdera2-trunk/ws/abdera2/examples/src/test/resources>
[INFO] Copying 2 resources

[INFO] 
[INFO] --- maven-resources-plugin:2.4.3:testResources (default-testResources) @ abdera2-examples
---
mojoSucceeded org.apache.maven.plugins:maven-resources-plugin:2.4.3(default-testResources)
mojoStarted org.apache.maven.plugins:maven-compiler-plugin:2.3.2(default-testCompile)[INFO]
No sources to compile

[INFO] 
[INFO] --- maven-compiler-plugin:2.3.2:testCompile (default-testCompile) @ abdera2-examples
---
mojoSucceeded org.apache.maven.plugins:maven-compiler-plugin:2.3.2(default-testCompile)
mojoStarted org.apache.maven.plugins:maven-surefire-plugin:2.6(default-test)[INFO] Surefire
report directory: <https://builds.apache.org/job/Abdera2-trunk/ws/abdera2/examples/target/surefire-reports>

[INFO] 
[INFO] --- maven-surefire-plugin:2.6:test (default-test) @ abdera2-examples ---

-------------------------------------------------------
 T E S T S
-------------------------------------------------------
There are no tests to run.

Results :

Tests run: 0, Failures: 0, Errors: 0, Skipped: 0

mojoSucceeded org.apache.maven.plugins:maven-surefire-plugin:2.6(default-test)
[JENKINS] Recording test results
mojoStarted org.apache.maven.plugins:maven-jar-plugin:2.2(default-jar)
[INFO] 
[INFO] --- maven-jar-plugin:2.2:jar (default-jar) @ abdera2-examples ---
[INFO] Building jar: <https://builds.apache.org/job/Abdera2-trunk/ws/abdera2/examples/target/abdera2-examples-2.0-SNAPSHOT.jar>
mojoSucceeded org.apache.maven.plugins:maven-jar-plugin:2.2(default-jar)
forkedProjectStarted org.apache.abdera2:abdera2-examples:2.0-SNAPSHOT
mojoStarted org.apache.felix:maven-bundle-plugin:2.1.0(default)
[INFO] 
[INFO] --- maven-bundle-plugin:2.1.0:cleanVersions (default) @ abdera2-examples ---
mojoSucceeded org.apache.felix:maven-bundle-plugin:2.1.0(default)
Jul 1, 2012 12:05:01 AM hudson.maven.ExecutedMojo <init>
WARNING: Failed to getClass for org.apache.maven.plugin.source.SourceJarMojo
forkedProjectSucceeded org.apache.abdera2:abdera2-examples:2.0-SNAPSHOT
mojoStarted org.apache.maven.plugins:maven-source-plugin:2.1.2(attach-sources)
[INFO] 
[INFO] --- maven-source-plugin:2.1.2:jar (attach-sources) @ abdera2-examples ---
[INFO] org already added, skipping
[INFO] org/apache already added, skipping
[INFO] META-INF already added, skipping
[INFO] META-INF already added, skipping
[INFO] META-INF/NOTICE already added, skipping
[INFO] META-INF/LICENSE already added, skipping
[INFO] Building jar: <https://builds.apache.org/job/Abdera2-trunk/ws/abdera2/examples/target/abdera2-examples-2.0-SNAPSHOT-sources.jar>
[INFO] org already added, skipping
[INFO] org/apache already added, skipping
[INFO] META-INF already added, skipping
[INFO] META-INF already added, skipping
[INFO] META-INF/NOTICE already added, skipping
[INFO] META-INF/LICENSE already added, skipping
mojoSucceeded org.apache.maven.plugins:maven-source-plugin:2.1.2(attach-sources)
[INFO] Installing <https://builds.apache.org/job/Abdera2-trunk/ws/abdera2/examples/target/abdera2-examples-2.0-SNAPSHOT.jar>
to /home/jenkins/jenkins-slave/maven-repositories/1/org/apache/abdera2/abdera2-examples/2.0-SNAPSHOT/abdera2-examples-2.0-SNAPSHOT.jar
mojoStarted org.apache.maven.plugins:maven-install-plugin:2.3.1(default-install)
[INFO] 
[INFO] --- maven-install-plugin:2.3.1:install (default-install) @ abdera2-examples ---
[INFO] Installing <https://builds.apache.org/job/Abdera2-trunk/ws/abdera2/examples/pom.xml>
to /home/jenkins/jenkins-slave/maven-repositories/1/org/apache/abdera2/abdera2-examples/2.0-SNAPSHOT/abdera2-examples-2.0-SNAPSHOT.pom
[INFO] Installing <https://builds.apache.org/job/Abdera2-trunk/ws/abdera2/examples/target/abdera2-examples-2.0-SNAPSHOT-sources.jar>
to /home/jenkins/jenkins-slave/maven-repositories/1/org/apache/abdera2/abdera2-examples/2.0-SNAPSHOT/abdera2-examples-2.0-SNAPSHOT-sources.jar
mojoSucceeded org.apache.maven.plugins:maven-install-plugin:2.3.1(default-install)
projectSucceeded org.apache.abdera2:abdera2-examples:2.0-SNAPSHOT
sessionEnded
[INFO] ------------------------------------------------------------------------
[INFO] Reactor Summary:
[INFO] 
[INFO] Apache Abdera2 .................................... SUCCESS [21.192s]
[INFO] Abdera2 Common Library ............................ SUCCESS [24.156s]
[INFO] Abdera2 Core ...................................... SUCCESS [12.772s]
[INFO] Abdera2 Activities ................................ SUCCESS [11.219s]
[INFO] Abdera2 Extensions ................................ SUCCESS [9.334s]
[INFO] Abdera2 Security .................................. SUCCESS [5.876s]
[INFO] Abdera2 Tests ..................................... SUCCESS [1:26.644s]
[INFO] Abdera2 Examples .................................. SUCCESS [6.869s]
[INFO] ------------------------------------------------------------------------
[INFO] BUILD SUCCESS
[INFO] ------------------------------------------------------------------------
[INFO] Total time: 3:06.229s
[INFO] Finished at: Sun Jul 01 00:05:02 UTC 2012
[INFO] Final Memory: 53M/721M
[INFO] ------------------------------------------------------------------------
Projects to build: [MavenProject: org.apache.abdera2:abdera2:2.0-SNAPSHOT @ <https://builds.apache.org/job/Abdera2-trunk/ws/abdera2/pom.xml,>
MavenProject: org.apache.abdera2:abdera2-common:2.0-SNAPSHOT @ <https://builds.apache.org/job/Abdera2-trunk/ws/abdera2/common/pom.xml,>
MavenProject: org.apache.abdera2:abdera2-core:2.0-SNAPSHOT @ <https://builds.apache.org/job/Abdera2-trunk/ws/abdera2/core/pom.xml,>
MavenProject: org.apache.abdera2:abdera2-activities:2.0-SNAPSHOT @ <https://builds.apache.org/job/Abdera2-trunk/ws/abdera2/activities/pom.xml,>
MavenProject: org.apache.abdera2:abdera2-ext:2.0-SNAPSHOT @ <https://builds.apache.org/job/Abdera2-trunk/ws/abdera2/ext/pom.xml,>
MavenProject: org.apache.abdera2:abdera2-security:2.0-SNAPSHOT @ <https://builds.apache.org/job/Abdera2-trunk/ws/abdera2/security/pom.xml,>
MavenProject: org.apache.abdera2:abdera2-test:2.0-SNAPSHOT @ <https://builds.apache.org/job/Abdera2-trunk/ws/abdera2/test/pom.xml,>
MavenProject: org.apache.abdera2:abdera2-examples:2.0-SNAPSHOT @ <https://builds.apache.org/job/Abdera2-trunk/ws/abdera2/examples/pom.xml]>
[JENKINS] Archiving <https://builds.apache.org/job/Abdera2-trunk/ws/abdera2/test/pom.xml>
to /home/hudson/hudson/jobs/Abdera2-trunk/modules/org.apache.abdera2$abdera2-test/builds/2012-07-01_00-01-42/archive/org.apache.abdera2/abdera2-test/2.0-SNAPSHOT/abdera2-test-2.0-SNAPSHOT.pom
[JENKINS] Archiving <https://builds.apache.org/job/Abdera2-trunk/ws/abdera2/test/target/abdera2-test-2.0-SNAPSHOT.jar>
to /home/hudson/hudson/jobs/Abdera2-trunk/modules/org.apache.abdera2$abdera2-test/builds/2012-07-01_00-01-42/archive/org.apache.abdera2/abdera2-test/2.0-SNAPSHOT/abdera2-test-2.0-SNAPSHOT.jar
[JENKINS] Archiving <https://builds.apache.org/job/Abdera2-trunk/ws/abdera2/test/target/abdera2-test-2.0-SNAPSHOT-sources.jar>
to /home/hudson/hudson/jobs/Abdera2-trunk/modules/org.apache.abdera2$abdera2-test/builds/2012-07-01_00-01-42/archive/org.apache.abdera2/abdera2-test/2.0-SNAPSHOT/abdera2-test-2.0-SNAPSHOT-sources.jar
[JENKINS] Archiving <https://builds.apache.org/job/Abdera2-trunk/ws/abdera2/core/pom.xml>
to /home/hudson/hudson/jobs/Abdera2-trunk/modules/org.apache.abdera2$abdera2-core/builds/2012-07-01_00-01-41/archive/org.apache.abdera2/abdera2-core/2.0-SNAPSHOT/abdera2-core-2.0-SNAPSHOT.pom
[JENKINS] Archiving <https://builds.apache.org/job/Abdera2-trunk/ws/abdera2/core/target/abdera2-core-2.0-SNAPSHOT.jar>
to /home/hudson/hudson/jobs/Abdera2-trunk/modules/org.apache.abdera2$abdera2-core/builds/2012-07-01_00-01-41/archive/org.apache.abdera2/abdera2-core/2.0-SNAPSHOT/abdera2-core-2.0-SNAPSHOT.jar
[JENKINS] Archiving <https://builds.apache.org/job/Abdera2-trunk/ws/abdera2/core/target/abdera2-core-2.0-SNAPSHOT-sources.jar>
to /home/hudson/hudson/jobs/Abdera2-trunk/modules/org.apache.abdera2$abdera2-core/builds/2012-07-01_00-01-41/archive/org.apache.abdera2/abdera2-core/2.0-SNAPSHOT/abdera2-core-2.0-SNAPSHOT-sources.jar
[JENKINS] Archiving <https://builds.apache.org/job/Abdera2-trunk/ws/abdera2/examples/pom.xml>
to /home/hudson/hudson/jobs/Abdera2-trunk/modules/org.apache.abdera2$abdera2-examples/builds/2012-07-01_00-01-42/archive/org.apache.abdera2/abdera2-examples/2.0-SNAPSHOT/abdera2-examples-2.0-SNAPSHOT.pom
[JENKINS] Archiving <https://builds.apache.org/job/Abdera2-trunk/ws/abdera2/examples/target/abdera2-examples-2.0-SNAPSHOT.jar>
to /home/hudson/hudson/jobs/Abdera2-trunk/modules/org.apache.abdera2$abdera2-examples/builds/2012-07-01_00-01-42/archive/org.apache.abdera2/abdera2-examples/2.0-SNAPSHOT/abdera2-examples-2.0-SNAPSHOT.jar
[JENKINS] Archiving <https://builds.apache.org/job/Abdera2-trunk/ws/abdera2/examples/target/abdera2-examples-2.0-SNAPSHOT-sources.jar>
to /home/hudson/hudson/jobs/Abdera2-trunk/modules/org.apache.abdera2$abdera2-examples/builds/2012-07-01_00-01-42/archive/org.apache.abdera2/abdera2-examples/2.0-SNAPSHOT/abdera2-examples-2.0-SNAPSHOT-sources.jar
[JENKINS] Archiving <https://builds.apache.org/job/Abdera2-trunk/ws/abdera2/security/pom.xml>
to /home/hudson/hudson/jobs/Abdera2-trunk/modules/org.apache.abdera2$abdera2-security/builds/2012-07-01_00-01-42/archive/org.apache.abdera2/abdera2-security/2.0-SNAPSHOT/abdera2-security-2.0-SNAPSHOT.pom
[JENKINS] Archiving <https://builds.apache.org/job/Abdera2-trunk/ws/abdera2/security/target/abdera2-security-2.0-SNAPSHOT.jar>
to /home/hudson/hudson/jobs/Abdera2-trunk/modules/org.apache.abdera2$abdera2-security/builds/2012-07-01_00-01-42/archive/org.apache.abdera2/abdera2-security/2.0-SNAPSHOT/abdera2-security-2.0-SNAPSHOT.jar
[JENKINS] Archiving <https://builds.apache.org/job/Abdera2-trunk/ws/abdera2/security/target/abdera2-security-2.0-SNAPSHOT-sources.jar>
to /home/hudson/hudson/jobs/Abdera2-trunk/modules/org.apache.abdera2$abdera2-security/builds/2012-07-01_00-01-42/archive/org.apache.abdera2/abdera2-security/2.0-SNAPSHOT/abdera2-security-2.0-SNAPSHOT-sources.jar
[JENKINS] Archiving <https://builds.apache.org/job/Abdera2-trunk/ws/abdera2/common/pom.xml>
to /home/hudson/hudson/jobs/Abdera2-trunk/modules/org.apache.abdera2$abdera2-common/builds/2012-07-01_00-01-41/archive/org.apache.abdera2/abdera2-common/2.0-SNAPSHOT/abdera2-common-2.0-SNAPSHOT.pom
[JENKINS] Archiving <https://builds.apache.org/job/Abdera2-trunk/ws/abdera2/common/target/abdera2-common-2.0-SNAPSHOT.jar>
to /home/hudson/hudson/jobs/Abdera2-trunk/modules/org.apache.abdera2$abdera2-common/builds/2012-07-01_00-01-41/archive/org.apache.abdera2/abdera2-common/2.0-SNAPSHOT/abdera2-common-2.0-SNAPSHOT.jar
[JENKINS] Archiving <https://builds.apache.org/job/Abdera2-trunk/ws/abdera2/common/target/abdera2-common-2.0-SNAPSHOT-sources.jar>
to /home/hudson/hudson/jobs/Abdera2-trunk/modules/org.apache.abdera2$abdera2-common/builds/2012-07-01_00-01-41/archive/org.apache.abdera2/abdera2-common/2.0-SNAPSHOT/abdera2-common-2.0-SNAPSHOT-sources.jar
[JENKINS] Archiving <https://builds.apache.org/job/Abdera2-trunk/ws/abdera2/activities/pom.xml>
to /home/hudson/hudson/jobs/Abdera2-trunk/modules/org.apache.abdera2$abdera2-activities/builds/2012-07-01_00-01-42/archive/org.apache.abdera2/abdera2-activities/2.0-SNAPSHOT/abdera2-activities-2.0-SNAPSHOT.pom
[JENKINS] Archiving <https://builds.apache.org/job/Abdera2-trunk/ws/abdera2/activities/target/abdera2-activities-2.0-SNAPSHOT.jar>
to /home/hudson/hudson/jobs/Abdera2-trunk/modules/org.apache.abdera2$abdera2-activities/builds/2012-07-01_00-01-42/archive/org.apache.abdera2/abdera2-activities/2.0-SNAPSHOT/abdera2-activities-2.0-SNAPSHOT.jar
[JENKINS] Archiving <https://builds.apache.org/job/Abdera2-trunk/ws/abdera2/activities/target/abdera2-activities-2.0-SNAPSHOT-sources.jar>
to /home/hudson/hudson/jobs/Abdera2-trunk/modules/org.apache.abdera2$abdera2-activities/builds/2012-07-01_00-01-42/archive/org.apache.abdera2/abdera2-activities/2.0-SNAPSHOT/abdera2-activities-2.0-SNAPSHOT-sources.jar
[JENKINS] Archiving <https://builds.apache.org/job/Abdera2-trunk/ws/abdera2/pom.xml>
to /home/hudson/hudson/jobs/Abdera2-trunk/modules/org.apache.abdera2$abdera2/builds/2012-07-01_00-01-41/archive/org.apache.abdera2/abdera2/2.0-SNAPSHOT/abdera2-2.0-SNAPSHOT.pom
[JENKINS] Archiving <https://builds.apache.org/job/Abdera2-trunk/ws/abdera2/ext/pom.xml>
to /home/hudson/hudson/jobs/Abdera2-trunk/modules/org.apache.abdera2$abdera2-ext/builds/2012-07-01_00-01-42/archive/org.apache.abdera2/abdera2-ext/2.0-SNAPSHOT/abdera2-ext-2.0-SNAPSHOT.pom
[JENKINS] Archiving <https://builds.apache.org/job/Abdera2-trunk/ws/abdera2/ext/target/abdera2-ext-2.0-SNAPSHOT.jar>
to /home/hudson/hudson/jobs/Abdera2-trunk/modules/org.apache.abdera2$abdera2-ext/builds/2012-07-01_00-01-42/archive/org.apache.abdera2/abdera2-ext/2.0-SNAPSHOT/abdera2-ext-2.0-SNAPSHOT.jar
[JENKINS] Archiving <https://builds.apache.org/job/Abdera2-trunk/ws/abdera2/ext/target/abdera2-ext-2.0-SNAPSHOT-sources.jar>
to /home/hudson/hudson/jobs/Abdera2-trunk/modules/org.apache.abdera2$abdera2-ext/builds/2012-07-01_00-01-42/archive/org.apache.abdera2/abdera2-ext/2.0-SNAPSHOT/abdera2-ext-2.0-SNAPSHOT-sources.jar
Waiting for Jenkins to finish collecting data
channel stopped
Maven RedeployPublished use remote ubuntu4 maven settings from : /home/jenkins/.m2/settings.xml
[ERROR] uniqueVersion == false is not anymore supported in maven 3
[INFO] Deployment in https://repository.apache.org/content/repositories/snapshots (id=apache.snapshots.https,uniqueVersion=false)
Deploying the main artifact abdera2-2.0-SNAPSHOT.pom
Downloading: https://repository.apache.org/content/repositories/snapshots/org/apache/abdera2/abdera2/2.0-SNAPSHOT/maven-metadata.xml
ERROR: Failed to retrieve remote metadata org.apache.abdera2:abdera2:2.0-SNAPSHOT/maven-metadata.xml:
Could not transfer metadata org.apache.abdera2:abdera2:2.0-SNAPSHOT/maven-metadata.xml from/to
apache.snapshots.https (https://repository.apache.org/content/repositories/snapshots): Failed
to transfer file: https://repository.apache.org/content/repositories/snapshots/org/apache/abdera2/abdera2/2.0-SNAPSHOT/maven-metadata.xml.
Return code is: 503, ReasonPhrase:Service Temporarily Unavailable.
org.apache.maven.artifact.deployer.ArtifactDeploymentException: Failed to retrieve remote
metadata org.apache.abdera2:abdera2:2.0-SNAPSHOT/maven-metadata.xml: Could not transfer metadata
org.apache.abdera2:abdera2:2.0-SNAPSHOT/maven-metadata.xml from/to apache.snapshots.https
(https://repository.apache.org/content/repositories/snapshots): Failed to transfer file: https://repository.apache.org/content/repositories/snapshots/org/apache/abdera2/abdera2/2.0-SNAPSHOT/maven-metadata.xml.
Return code is: 503, ReasonPhrase:Service Temporarily Unavailable.
	at org.apache.maven.artifact.deployer.DefaultArtifactDeployer.deploy(DefaultArtifactDeployer.java:141)
	at hudson.maven.reporters.MavenArtifactRecord.deploy(MavenArtifactRecord.java:182)
	at hudson.maven.RedeployPublisher.perform(RedeployPublisher.java:174)
	at hudson.tasks.BuildStepMonitor$1.perform(BuildStepMonitor.java:19)
	at hudson.model.AbstractBuild$AbstractBuildExecution.perform(AbstractBuild.java:717)
	at hudson.model.AbstractBuild$AbstractBuildExecution.performAllBuildSteps(AbstractBuild.java:692)
	at hudson.maven.MavenModuleSetBuild$MavenModuleSetBuildExecution.post2(MavenModuleSetBuild.java:994)
	at hudson.model.AbstractBuild$AbstractBuildExecution.post(AbstractBuild.java:639)
	at hudson.model.Run.execute(Run.java:1485)
	at hudson.maven.MavenModuleSetBuild.run(MavenModuleSetBuild.java:477)
	at hudson.model.ResourceController.execute(ResourceController.java:88)
	at hudson.model.Executor.run(Executor.java:239)
Caused by: org.sonatype.aether.deployment.DeploymentException: Failed to retrieve remote metadata
org.apache.abdera2:abdera2:2.0-SNAPSHOT/maven-metadata.xml: Could not transfer metadata org.apache.abdera2:abdera2:2.0-SNAPSHOT/maven-metadata.xml
from/to apache.snapshots.https (https://repository.apache.org/content/repositories/snapshots):
Failed to transfer file: https://repository.apache.org/content/repositories/snapshots/org/apache/abdera2/abdera2/2.0-SNAPSHOT/maven-metadata.xml.
Return code is: 503, ReasonPhrase:Service Temporarily Unavailable.
	at org.sonatype.aether.impl.internal.DefaultDeployer.upload(DefaultDeployer.java:403)
	at org.sonatype.aether.impl.internal.DefaultDeployer.deploy(DefaultDeployer.java:256)
	at org.sonatype.aether.impl.internal.DefaultDeployer.deploy(DefaultDeployer.java:211)
	at org.sonatype.aether.impl.internal.DefaultRepositorySystem.deploy(DefaultRepositorySystem.java:443)
	at org.apache.maven.artifact.deployer.DefaultArtifactDeployer.deploy(DefaultArtifactDeployer.java:137)
	... 11 more
Caused by: org.sonatype.aether.transfer.MetadataTransferException: Could not transfer metadata
org.apache.abdera2:abdera2:2.0-SNAPSHOT/maven-metadata.xml from/to apache.snapshots.https
(https://repository.apache.org/content/repositories/snapshots): Failed to transfer file: https://repository.apache.org/content/repositories/snapshots/org/apache/abdera2/abdera2/2.0-SNAPSHOT/maven-metadata.xml.
Return code is: 503, ReasonPhrase:Service Temporarily Unavailable.
	at org.sonatype.aether.connector.wagon.WagonRepositoryConnector$3.wrap(WagonRepositoryConnector.java:930)
	at org.sonatype.aether.connector.wagon.WagonRepositoryConnector$3.wrap(WagonRepositoryConnector.java:920)
	at org.sonatype.aether.connector.wagon.WagonRepositoryConnector$GetTask.run(WagonRepositoryConnector.java:669)
	at org.sonatype.aether.util.concurrency.RunnableErrorForwarder$1.run(RunnableErrorForwarder.java:60)
	at java.util.concurrent.ThreadPoolExecutor.runWorker(ThreadPoolExecutor.java:1110)
	at java.util.concurrent.ThreadPoolExecutor$Worker.run(ThreadPoolExecutor.java:603)
	at java.lang.Thread.run(Thread.java:722)
Caused by: org.apache.maven.wagon.TransferFailedException: Failed to transfer file: https://repository.apache.org/content/repositories/snapshots/org/apache/abdera2/abdera2/2.0-SNAPSHOT/maven-metadata.xml.
Return code is: 503, ReasonPhrase:Service Temporarily Unavailable.
	at org.apache.maven.wagon.shared.http4.AbstractHttpClientWagon.fillInputData(AbstractHttpClientWagon.java:852)
	at org.apache.maven.wagon.StreamWagon.getInputStream(StreamWagon.java:116)
	at org.apache.maven.wagon.StreamWagon.getIfNewer(StreamWagon.java:88)
	at org.apache.maven.wagon.StreamWagon.get(StreamWagon.java:61)
	at org.sonatype.aether.connector.wagon.WagonRepositoryConnector$GetTask.run(WagonRepositoryConnector.java:601)
	... 4 more
[INFO] Deployment failed after 0.6 sec
Build step 'Deploy artifacts to Maven repository' changed build result to FAILURE

Mime
View raw message