abdera-dev mailing list archives

Site index · List index
Message view « Date » · « Thread »
Top « Date » · « Thread »
From Apache Jenkins Server <jenk...@builds.apache.org>
Subject Build failed in Jenkins: Abdera-trunk #713
Date Tue, 17 Apr 2012 00:08:54 GMT
See <https://builds.apache.org/job/Abdera-trunk/713/>

------------------------------------------
[...truncated 3398 lines...]
[WARNING] We have a duplicate org/apache/abdera/protocol/util/AbstractMessage.class in <https://builds.apache.org/job/Abdera-trunk/ws/trunk/extensions/gdata/target/abdera-extensions-gdata-1.2-SNAPSHOT.jar>
[WARNING] We have a duplicate org/apache/abdera/protocol/util/AbstractRequest.class in <https://builds.apache.org/job/Abdera-trunk/ws/trunk/extensions/gdata/target/abdera-extensions-gdata-1.2-SNAPSHOT.jar>
[WARNING] We have a duplicate org/apache/abdera/protocol/util/AbstractResponse.class in <https://builds.apache.org/job/Abdera-trunk/ws/trunk/extensions/gdata/target/abdera-extensions-gdata-1.2-SNAPSHOT.jar>
[WARNING] We have a duplicate org/apache/abdera/protocol/util/CacheControlUtil$1.class in
<https://builds.apache.org/job/Abdera-trunk/ws/trunk/extensions/gdata/target/abdera-extensions-gdata-1.2-SNAPSHOT.jar>
[WARNING] We have a duplicate org/apache/abdera/protocol/util/CacheControlUtil$CacheControlParser.class
in <https://builds.apache.org/job/Abdera-trunk/ws/trunk/extensions/gdata/target/abdera-extensions-gdata-1.2-SNAPSHOT.jar>
[WARNING] We have a duplicate org/apache/abdera/protocol/util/CacheControlUtil$Directive.class
in <https://builds.apache.org/job/Abdera-trunk/ws/trunk/extensions/gdata/target/abdera-extensions-gdata-1.2-SNAPSHOT.jar>
[WARNING] We have a duplicate org/apache/abdera/protocol/util/CacheControlUtil$Idempotent.class
in <https://builds.apache.org/job/Abdera-trunk/ws/trunk/extensions/gdata/target/abdera-extensions-gdata-1.2-SNAPSHOT.jar>
[WARNING] We have a duplicate org/apache/abdera/protocol/util/CacheControlUtil.class in <https://builds.apache.org/job/Abdera-trunk/ws/trunk/extensions/gdata/target/abdera-extensions-gdata-1.2-SNAPSHOT.jar>
[WARNING] We have a duplicate org/apache/abdera/protocol/util/PoolManager$1.class in <https://builds.apache.org/job/Abdera-trunk/ws/trunk/extensions/gdata/target/abdera-extensions-gdata-1.2-SNAPSHOT.jar>
[WARNING] We have a duplicate org/apache/abdera/protocol/util/PoolManager.class in <https://builds.apache.org/job/Abdera-trunk/ws/trunk/extensions/gdata/target/abdera-extensions-gdata-1.2-SNAPSHOT.jar>
[WARNING] We have a duplicate org/apache/abdera/protocol/util/ProtocolConstants.class in <https://builds.apache.org/job/Abdera-trunk/ws/trunk/extensions/gdata/target/abdera-extensions-gdata-1.2-SNAPSHOT.jar>
[WARNING] We have a duplicate org/apache/abdera/util/AbderaConfiguration.class in <https://builds.apache.org/job/Abdera-trunk/ws/trunk/extensions/gdata/target/abdera-extensions-gdata-1.2-SNAPSHOT.jar>
[WARNING] We have a duplicate org/apache/abdera/util/AbderaDataSource.class in <https://builds.apache.org/job/Abdera-trunk/ws/trunk/extensions/gdata/target/abdera-extensions-gdata-1.2-SNAPSHOT.jar>
[WARNING] We have a duplicate org/apache/abdera/util/AbderaResult.class in <https://builds.apache.org/job/Abdera-trunk/ws/trunk/extensions/gdata/target/abdera-extensions-gdata-1.2-SNAPSHOT.jar>
[WARNING] We have a duplicate org/apache/abdera/util/AbderaSource.class in <https://builds.apache.org/job/Abdera-trunk/ws/trunk/extensions/gdata/target/abdera-extensions-gdata-1.2-SNAPSHOT.jar>
[WARNING] We have a duplicate org/apache/abdera/util/AbstractExtensionFactory.class in <https://builds.apache.org/job/Abdera-trunk/ws/trunk/extensions/gdata/target/abdera-extensions-gdata-1.2-SNAPSHOT.jar>
[WARNING] We have a duplicate org/apache/abdera/util/AbstractNamedParser.class in <https://builds.apache.org/job/Abdera-trunk/ws/trunk/extensions/gdata/target/abdera-extensions-gdata-1.2-SNAPSHOT.jar>
[WARNING] We have a duplicate org/apache/abdera/util/AbstractNamedWriter.class in <https://builds.apache.org/job/Abdera-trunk/ws/trunk/extensions/gdata/target/abdera-extensions-gdata-1.2-SNAPSHOT.jar>
[WARNING] We have a duplicate org/apache/abdera/util/AbstractParser.class in <https://builds.apache.org/job/Abdera-trunk/ws/trunk/extensions/gdata/target/abdera-extensions-gdata-1.2-SNAPSHOT.jar>
[WARNING] We have a duplicate org/apache/abdera/util/AbstractParserOptions.class in <https://builds.apache.org/job/Abdera-trunk/ws/trunk/extensions/gdata/target/abdera-extensions-gdata-1.2-SNAPSHOT.jar>
[WARNING] We have a duplicate org/apache/abdera/util/AbstractStreamWriter.class in <https://builds.apache.org/job/Abdera-trunk/ws/trunk/extensions/gdata/target/abdera-extensions-gdata-1.2-SNAPSHOT.jar>
[WARNING] We have a duplicate org/apache/abdera/util/AbstractWriter.class in <https://builds.apache.org/job/Abdera-trunk/ws/trunk/extensions/gdata/target/abdera-extensions-gdata-1.2-SNAPSHOT.jar>
[WARNING] We have a duplicate org/apache/abdera/util/AbstractWriterOptions.class in <https://builds.apache.org/job/Abdera-trunk/ws/trunk/extensions/gdata/target/abdera-extensions-gdata-1.2-SNAPSHOT.jar>
[WARNING] We have a duplicate org/apache/abdera/util/AbstractXPath.class in <https://builds.apache.org/job/Abdera-trunk/ws/trunk/extensions/gdata/target/abdera-extensions-gdata-1.2-SNAPSHOT.jar>
[WARNING] We have a duplicate org/apache/abdera/util/Configuration.class in <https://builds.apache.org/job/Abdera-trunk/ws/trunk/extensions/gdata/target/abdera-extensions-gdata-1.2-SNAPSHOT.jar>
[WARNING] We have a duplicate org/apache/abdera/util/Constants.class in <https://builds.apache.org/job/Abdera-trunk/ws/trunk/extensions/gdata/target/abdera-extensions-gdata-1.2-SNAPSHOT.jar>
[WARNING] We have a duplicate org/apache/abdera/util/Discover$DefaultLoader.class in <https://builds.apache.org/job/Abdera-trunk/ws/trunk/extensions/gdata/target/abdera-extensions-gdata-1.2-SNAPSHOT.jar>
[WARNING] We have a duplicate org/apache/abdera/util/Discover$DefaultLoaderIterator.class
in <https://builds.apache.org/job/Abdera-trunk/ws/trunk/extensions/gdata/target/abdera-extensions-gdata-1.2-SNAPSHOT.jar>
[WARNING] We have a duplicate org/apache/abdera/util/Discover$LineReaderLoaderIterator.class
in <https://builds.apache.org/job/Abdera-trunk/ws/trunk/extensions/gdata/target/abdera-extensions-gdata-1.2-SNAPSHOT.jar>
[WARNING] We have a duplicate org/apache/abdera/util/Discover$LoaderIterator.class in <https://builds.apache.org/job/Abdera-trunk/ws/trunk/extensions/gdata/target/abdera-extensions-gdata-1.2-SNAPSHOT.jar>
[WARNING] We have a duplicate org/apache/abdera/util/Discover.class in <https://builds.apache.org/job/Abdera-trunk/ws/trunk/extensions/gdata/target/abdera-extensions-gdata-1.2-SNAPSHOT.jar>
[WARNING] We have a duplicate org/apache/abdera/util/EntityTag.class in <https://builds.apache.org/job/Abdera-trunk/ws/trunk/extensions/gdata/target/abdera-extensions-gdata-1.2-SNAPSHOT.jar>
[WARNING] We have a duplicate org/apache/abdera/util/MimeTypeHelper$1.class in <https://builds.apache.org/job/Abdera-trunk/ws/trunk/extensions/gdata/target/abdera-extensions-gdata-1.2-SNAPSHOT.jar>
[WARNING] We have a duplicate org/apache/abdera/util/MimeTypeHelper.class in <https://builds.apache.org/job/Abdera-trunk/ws/trunk/extensions/gdata/target/abdera-extensions-gdata-1.2-SNAPSHOT.jar>
[WARNING] We have a duplicate org/apache/abdera/util/MimeTypeParseException.class in <https://builds.apache.org/job/Abdera-trunk/ws/trunk/extensions/gdata/target/abdera-extensions-gdata-1.2-SNAPSHOT.jar>
[WARNING] We have a duplicate org/apache/abdera/util/MultiIterator.class in <https://builds.apache.org/job/Abdera-trunk/ws/trunk/extensions/gdata/target/abdera-extensions-gdata-1.2-SNAPSHOT.jar>
[WARNING] We have a duplicate org/apache/abdera/util/NamedItem.class in <https://builds.apache.org/job/Abdera-trunk/ws/trunk/extensions/gdata/target/abdera-extensions-gdata-1.2-SNAPSHOT.jar>
[WARNING] We have a duplicate org/apache/abdera/util/ServiceUtil.class in <https://builds.apache.org/job/Abdera-trunk/ws/trunk/extensions/gdata/target/abdera-extensions-gdata-1.2-SNAPSHOT.jar>
[WARNING] We have a duplicate org/apache/abdera/util/Version.class in <https://builds.apache.org/job/Abdera-trunk/ws/trunk/extensions/gdata/target/abdera-extensions-gdata-1.2-SNAPSHOT.jar>
[WARNING] We have a duplicate org/apache/abdera/util/XmlRestrictedCharReader.class in <https://builds.apache.org/job/Abdera-trunk/ws/trunk/extensions/gdata/target/abdera-extensions-gdata-1.2-SNAPSHOT.jar>
[WARNING] We have a duplicate org/apache/abdera/util/XmlUtil$XMLVersion.class in <https://builds.apache.org/job/Abdera-trunk/ws/trunk/extensions/gdata/target/abdera-extensions-gdata-1.2-SNAPSHOT.jar>
[WARNING] We have a duplicate org/apache/abdera/util/XmlUtil$XmlFilter.class in <https://builds.apache.org/job/Abdera-trunk/ws/trunk/extensions/gdata/target/abdera-extensions-gdata-1.2-SNAPSHOT.jar>
[WARNING] We have a duplicate org/apache/abdera/util/XmlUtil.class in <https://builds.apache.org/job/Abdera-trunk/ws/trunk/extensions/gdata/target/abdera-extensions-gdata-1.2-SNAPSHOT.jar>
[WARNING] We have a duplicate org/apache/abdera/util/filter/AbstractListParseFilter.class
in <https://builds.apache.org/job/Abdera-trunk/ws/trunk/extensions/gdata/target/abdera-extensions-gdata-1.2-SNAPSHOT.jar>
[WARNING] We have a duplicate org/apache/abdera/util/filter/AbstractParseFilter.class in <https://builds.apache.org/job/Abdera-trunk/ws/trunk/extensions/gdata/target/abdera-extensions-gdata-1.2-SNAPSHOT.jar>
[WARNING] We have a duplicate org/apache/abdera/util/filter/BlackListParseFilter.class in
<https://builds.apache.org/job/Abdera-trunk/ws/trunk/extensions/gdata/target/abdera-extensions-gdata-1.2-SNAPSHOT.jar>
[WARNING] We have a duplicate org/apache/abdera/util/filter/CompoundParseFilter$1.class in
<https://builds.apache.org/job/Abdera-trunk/ws/trunk/extensions/gdata/target/abdera-extensions-gdata-1.2-SNAPSHOT.jar>
[WARNING] We have a duplicate org/apache/abdera/util/filter/CompoundParseFilter$Condition.class
in <https://builds.apache.org/job/Abdera-trunk/ws/trunk/extensions/gdata/target/abdera-extensions-gdata-1.2-SNAPSHOT.jar>
[WARNING] We have a duplicate org/apache/abdera/util/filter/CompoundParseFilter.class in <https://builds.apache.org/job/Abdera-trunk/ws/trunk/extensions/gdata/target/abdera-extensions-gdata-1.2-SNAPSHOT.jar>
[WARNING] We have a duplicate org/apache/abdera/util/filter/NonOpParseFilter.class in <https://builds.apache.org/job/Abdera-trunk/ws/trunk/extensions/gdata/target/abdera-extensions-gdata-1.2-SNAPSHOT.jar>
[WARNING] We have a duplicate org/apache/abdera/util/filter/SafeContentWhiteListParseFilter$xhtml_attributes.class
in <https://builds.apache.org/job/Abdera-trunk/ws/trunk/extensions/gdata/target/abdera-extensions-gdata-1.2-SNAPSHOT.jar>
[WARNING] We have a duplicate org/apache/abdera/util/filter/SafeContentWhiteListParseFilter$xhtml_elements.class
in <https://builds.apache.org/job/Abdera-trunk/ws/trunk/extensions/gdata/target/abdera-extensions-gdata-1.2-SNAPSHOT.jar>
[WARNING] We have a duplicate org/apache/abdera/util/filter/SafeContentWhiteListParseFilter.class
in <https://builds.apache.org/job/Abdera-trunk/ws/trunk/extensions/gdata/target/abdera-extensions-gdata-1.2-SNAPSHOT.jar>
[WARNING] We have a duplicate org/apache/abdera/util/filter/WhiteListParseFilter.class in
<https://builds.apache.org/job/Abdera-trunk/ws/trunk/extensions/gdata/target/abdera-extensions-gdata-1.2-SNAPSHOT.jar>
[WARNING] We have a duplicate org/apache/abdera/writer/NamedWriter.class in <https://builds.apache.org/job/Abdera-trunk/ws/trunk/extensions/gdata/target/abdera-extensions-gdata-1.2-SNAPSHOT.jar>
[WARNING] We have a duplicate org/apache/abdera/writer/StreamWriter.class in <https://builds.apache.org/job/Abdera-trunk/ws/trunk/extensions/gdata/target/abdera-extensions-gdata-1.2-SNAPSHOT.jar>
[WARNING] We have a duplicate org/apache/abdera/writer/Writer.class in <https://builds.apache.org/job/Abdera-trunk/ws/trunk/extensions/gdata/target/abdera-extensions-gdata-1.2-SNAPSHOT.jar>
[WARNING] We have a duplicate org/apache/abdera/writer/WriterFactory.class in <https://builds.apache.org/job/Abdera-trunk/ws/trunk/extensions/gdata/target/abdera-extensions-gdata-1.2-SNAPSHOT.jar>
[WARNING] We have a duplicate org/apache/abdera/writer/WriterOptions.class in <https://builds.apache.org/job/Abdera-trunk/ws/trunk/extensions/gdata/target/abdera-extensions-gdata-1.2-SNAPSHOT.jar>
[WARNING] We have a duplicate org/apache/abdera/xpath/XPath.class in <https://builds.apache.org/job/Abdera-trunk/ws/trunk/extensions/gdata/target/abdera-extensions-gdata-1.2-SNAPSHOT.jar>
[WARNING] We have a duplicate org/apache/abdera/xpath/XPathException.class in <https://builds.apache.org/job/Abdera-trunk/ws/trunk/extensions/gdata/target/abdera-extensions-gdata-1.2-SNAPSHOT.jar>
[INFO] Replacing original artifact with shaded artifact.
[INFO] Replacing <https://builds.apache.org/job/Abdera-trunk/ws/trunk/bundle/target/abdera-bundle-1.2-SNAPSHOT.jar>
with <https://builds.apache.org/job/Abdera-trunk/ws/trunk/bundle/target/abdera-bundle-1.2-SNAPSHOT-shaded.jar>
Apr 17, 2012 12:05:59 AM hudson.maven.ExecutedMojo <init>
WARNING: Failed to getClass for org.apache.maven.plugin.source.SourceJarMojo
[INFO] META-INF already added, skipping
[INFO] META-INF/NOTICE already added, skipping
[INFO] META-INF/LICENSE already added, skipping
[INFO] Building jar: <https://builds.apache.org/job/Abdera-trunk/ws/trunk/bundle/target/abdera-bundle-1.2-SNAPSHOT-sources.jar>
[INFO] META-INF already added, skipping
[INFO] META-INF/NOTICE already added, skipping
[INFO] META-INF/LICENSE already added, skipping
[INFO] Installing <https://builds.apache.org/job/Abdera-trunk/ws/trunk/bundle/target/abdera-bundle-1.2-SNAPSHOT.jar>
to /home/jenkins/jenkins-slave/maven-repositories/1/org/apache/abdera/abdera-bundle/1.2-SNAPSHOT/abdera-bundle-1.2-SNAPSHOT.jar
[INFO] Installing <https://builds.apache.org/job/Abdera-trunk/ws/trunk/bundle/dependency-reduced-pom.xml>
to /home/jenkins/jenkins-slave/maven-repositories/1/org/apache/abdera/abdera-bundle/1.2-SNAPSHOT/abdera-bundle-1.2-SNAPSHOT.pom
[INFO] Installing <https://builds.apache.org/job/Abdera-trunk/ws/trunk/bundle/target/abdera-bundle-1.2-SNAPSHOT-sources.jar>
to /home/jenkins/jenkins-slave/maven-repositories/1/org/apache/abdera/abdera-bundle/1.2-SNAPSHOT/abdera-bundle-1.2-SNAPSHOT-sources.jar
Downloading: http://repo1.maven.org/maven2/org/apache/maven/plugins/maven-install-plugin/maven-metadata.xml
Downloaded: http://repo1.maven.org/maven2/org/apache/maven/plugins/maven-install-plugin/maven-metadata.xml
(503 B at 1.4 KB/sec)
Downloading: http://repo1.maven.org/maven2/org/apache/maven/plugins/maven-resources-plugin/maven-metadata.xml
Downloaded: http://repo1.maven.org/maven2/org/apache/maven/plugins/maven-resources-plugin/maven-metadata.xml
(657 B at 1.3 KB/sec)
Downloading: http://repo1.maven.org/maven2/org/apache/maven/plugins/maven-deploy-plugin/maven-metadata.xml
Downloaded: http://repo1.maven.org/maven2/org/apache/maven/plugins/maven-deploy-plugin/maven-metadata.xml
(614 B at 1.2 KB/sec)
[INFO] Deleting <https://builds.apache.org/job/Abdera-trunk/ws/trunk/extensions/rss/target>
[debug] execute contextualize
[INFO] Using 'UTF-8' encoding to copy filtered resources.
[INFO] Copying 1 resource
[INFO] Copying 2 resources
[INFO] Compiling 21 source files to <https://builds.apache.org/job/Abdera-trunk/ws/trunk/extensions/rss/target/classes>
[debug] execute contextualize
[INFO] Using 'UTF-8' encoding to copy filtered resources.
[INFO] Copying 1 resource
[INFO] Copying 2 resources
[INFO] Compiling 1 source file to <https://builds.apache.org/job/Abdera-trunk/ws/trunk/extensions/rss/target/test-classes>
[INFO] Surefire report directory: <https://builds.apache.org/job/Abdera-trunk/ws/trunk/extensions/rss/target/surefire-reports>

-------------------------------------------------------
 T E S T S
-------------------------------------------------------
Running org.apache.abdera.test.ext.rss.RssTest
Bob
Tests run: 1, Failures: 0, Errors: 0, Skipped: 0, Time elapsed: 0.381 sec

Results :

Tests run: 1, Failures: 0, Errors: 0, Skipped: 0

Apr 17, 2012 12:06:04 AM hudson.maven.ExecutedMojo <init>
WARNING: Failed to getClass for org.apache.maven.plugin.source.SourceJarMojo
[INFO] META-INF already added, skipping
[INFO] META-INF already added, skipping
[INFO] META-INF/NOTICE already added, skipping
[INFO] META-INF/LICENSE already added, skipping
[INFO] Building jar: <https://builds.apache.org/job/Abdera-trunk/ws/trunk/extensions/rss/target/abdera-extensions-rss-1.2-SNAPSHOT-sources.jar>
[INFO] META-INF already added, skipping
[INFO] META-INF already added, skipping
[INFO] META-INF/NOTICE already added, skipping
[INFO] META-INF/LICENSE already added, skipping
[INFO] Installing <https://builds.apache.org/job/Abdera-trunk/ws/trunk/extensions/rss/target/abdera-extensions-rss-1.2-SNAPSHOT.jar>
to /home/jenkins/jenkins-slave/maven-repositories/1/org/apache/abdera/abdera-extensions-rss/1.2-SNAPSHOT/abdera-extensions-rss-1.2-SNAPSHOT.jar
[INFO] Installing <https://builds.apache.org/job/Abdera-trunk/ws/trunk/extensions/rss/pom.xml>
to /home/jenkins/jenkins-slave/maven-repositories/1/org/apache/abdera/abdera-extensions-rss/1.2-SNAPSHOT/abdera-extensions-rss-1.2-SNAPSHOT.pom
[INFO] Installing <https://builds.apache.org/job/Abdera-trunk/ws/trunk/extensions/rss/target/abdera-extensions-rss-1.2-SNAPSHOT-sources.jar>
to /home/jenkins/jenkins-slave/maven-repositories/1/org/apache/abdera/abdera-extensions-rss/1.2-SNAPSHOT/abdera-extensions-rss-1.2-SNAPSHOT-sources.jar
[INFO] Installing org/apache/abdera/abdera-extensions-rss/1.2-SNAPSHOT/abdera-extensions-rss-1.2-SNAPSHOT.jar
[INFO] Writing OBR metadata
[INFO] Deleting <https://builds.apache.org/job/Abdera-trunk/ws/trunk/extensions/features/target>
[INFO] Using 'UTF-8' encoding to copy filtered resources.
[INFO] Copying 1 resource
[INFO] Copying 2 resources
[INFO] Compiling 9 source files to <https://builds.apache.org/job/Abdera-trunk/ws/trunk/extensions/features/target/classes>
[INFO] Using 'UTF-8' encoding to copy filtered resources.
[INFO] Copying 0 resource
[INFO] Copying 2 resources
[INFO] Compiling 2 source files to <https://builds.apache.org/job/Abdera-trunk/ws/trunk/extensions/features/target/test-classes>
[INFO] Surefire report directory: <https://builds.apache.org/job/Abdera-trunk/ws/trunk/extensions/features/target/surefire-reports>

-------------------------------------------------------
 T E S T S
-------------------------------------------------------
Running org.apache.abdera.test.ext.features.FeatureTest
Tests run: 4, Failures: 0, Errors: 0, Skipped: 0, Time elapsed: 0.281 sec

Results :

Tests run: 4, Failures: 0, Errors: 0, Skipped: 0

[INFO] Building jar: <https://builds.apache.org/job/Abdera-trunk/ws/trunk/extensions/features/target/abdera-extensions-features-1.2-SNAPSHOT.jar>
Apr 17, 2012 12:06:09 AM hudson.maven.ExecutedMojo <init>
WARNING: Failed to getClass for org.apache.maven.plugin.source.SourceJarMojo
[INFO] META-INF already added, skipping
[INFO] META-INF already added, skipping
[INFO] META-INF/NOTICE already added, skipping
[INFO] META-INF/LICENSE already added, skipping
[INFO] Building jar: <https://builds.apache.org/job/Abdera-trunk/ws/trunk/extensions/features/target/abdera-extensions-features-1.2-SNAPSHOT-sources.jar>
[INFO] META-INF already added, skipping
[INFO] META-INF already added, skipping
[INFO] META-INF/NOTICE already added, skipping
[INFO] META-INF/LICENSE already added, skipping
[INFO] Installing <https://builds.apache.org/job/Abdera-trunk/ws/trunk/extensions/features/target/abdera-extensions-features-1.2-SNAPSHOT.jar>
to /home/jenkins/jenkins-slave/maven-repositories/1/org/apache/abdera/abdera-extensions-features/1.2-SNAPSHOT/abdera-extensions-features-1.2-SNAPSHOT.jar
[INFO] Installing <https://builds.apache.org/job/Abdera-trunk/ws/trunk/extensions/features/pom.xml>
to /home/jenkins/jenkins-slave/maven-repositories/1/org/apache/abdera/abdera-extensions-features/1.2-SNAPSHOT/abdera-extensions-features-1.2-SNAPSHOT.pom
[INFO] Installing <https://builds.apache.org/job/Abdera-trunk/ws/trunk/extensions/features/target/abdera-extensions-features-1.2-SNAPSHOT-sources.jar>
to /home/jenkins/jenkins-slave/maven-repositories/1/org/apache/abdera/abdera-extensions-features/1.2-SNAPSHOT/abdera-extensions-features-1.2-SNAPSHOT-sources.jar
[INFO] Deleting <https://builds.apache.org/job/Abdera-trunk/ws/trunk/extensions/target>
Apr 17, 2012 12:06:10 AM hudson.maven.ExecutedMojo <init>
WARNING: Failed to getClass for org.apache.maven.plugin.source.SourceJarMojo
[INFO] Installing <https://builds.apache.org/job/Abdera-trunk/ws/trunk/extensions/pom.xml>
to /home/jenkins/jenkins-slave/maven-repositories/1/org/apache/abdera/abdera-extensions-parent/1.2-SNAPSHOT/abdera-extensions-parent-1.2-SNAPSHOT.pom
[INFO] Deleting <https://builds.apache.org/job/Abdera-trunk/ws/trunk/examples/target>
[INFO] Using 'UTF-8' encoding to copy filtered resources.
[INFO] Copying 10 resources
[INFO] Copying 2 resources
[INFO] Compiling 44 source files to <https://builds.apache.org/job/Abdera-trunk/ws/trunk/examples/target/classes>
[INFO] Using 'UTF-8' encoding to copy filtered resources.
[INFO] skip non existing resourceDirectory <https://builds.apache.org/job/Abdera-trunk/ws/trunk/examples/src/test/resources>
[INFO] Copying 2 resources
[INFO] No sources to compile
[INFO] Surefire report directory: <https://builds.apache.org/job/Abdera-trunk/ws/trunk/examples/target/surefire-reports>

-------------------------------------------------------
 T E S T S
-------------------------------------------------------
There are no tests to run.

Results :

Tests run: 0, Failures: 0, Errors: 0, Skipped: 0

[INFO] Building jar: <https://builds.apache.org/job/Abdera-trunk/ws/trunk/examples/target/abdera-examples-1.2-SNAPSHOT.jar>
Apr 17, 2012 12:06:13 AM hudson.maven.ExecutedMojo <init>
WARNING: Failed to getClass for org.apache.maven.plugin.source.SourceJarMojo
[INFO] META-INF already added, skipping
[INFO] org already added, skipping
[INFO] org/apache already added, skipping
[INFO] org/apache/abdera already added, skipping
[INFO] org/apache/abdera/examples already added, skipping
[INFO] org/apache/abdera/examples/appserver already added, skipping
[INFO] META-INF already added, skipping
[INFO] META-INF/NOTICE already added, skipping
[INFO] META-INF/LICENSE already added, skipping
[INFO] Building jar: <https://builds.apache.org/job/Abdera-trunk/ws/trunk/examples/target/abdera-examples-1.2-SNAPSHOT-sources.jar>
[INFO] META-INF already added, skipping
[INFO] org already added, skipping
[INFO] org/apache already added, skipping
[INFO] org/apache/abdera already added, skipping
[INFO] org/apache/abdera/examples already added, skipping
[INFO] org/apache/abdera/examples/appserver already added, skipping
[INFO] META-INF already added, skipping
[INFO] META-INF/NOTICE already added, skipping
[INFO] META-INF/LICENSE already added, skipping
[INFO] Installing <https://builds.apache.org/job/Abdera-trunk/ws/trunk/examples/target/abdera-examples-1.2-SNAPSHOT.jar>
to /home/jenkins/jenkins-slave/maven-repositories/1/org/apache/abdera/abdera-examples/1.2-SNAPSHOT/abdera-examples-1.2-SNAPSHOT.jar
[INFO] Installing <https://builds.apache.org/job/Abdera-trunk/ws/trunk/examples/pom.xml>
to /home/jenkins/jenkins-slave/maven-repositories/1/org/apache/abdera/abdera-examples/1.2-SNAPSHOT/abdera-examples-1.2-SNAPSHOT.pom
[INFO] Installing <https://builds.apache.org/job/Abdera-trunk/ws/trunk/examples/target/abdera-examples-1.2-SNAPSHOT-sources.jar>
to /home/jenkins/jenkins-slave/maven-repositories/1/org/apache/abdera/abdera-examples/1.2-SNAPSHOT/abdera-examples-1.2-SNAPSHOT-sources.jar
channel stopped
Maven RedeployPublished use remote ubuntu3 maven settings from : /home/jenkins/.m2/settings.xml
[ERROR] uniqueVersion == false is not anymore supported in maven 3
[INFO] Deployment in https://repository.apache.org/content/repositories/snapshots (id=,uniqueVersion=false)
Deploying the main artifact abdera-1.2-SNAPSHOT.pom
Downloading: https://repository.apache.org/content/repositories/snapshots/org/apache/abdera/abdera/1.2-SNAPSHOT/maven-metadata.xml
Downloaded: https://repository.apache.org/content/repositories/snapshots/org/apache/abdera/abdera/1.2-SNAPSHOT/maven-metadata.xml
(598 B at 1.2 KB/sec)
Uploading: https://repository.apache.org/content/repositories/snapshots/org/apache/abdera/abdera/1.2-SNAPSHOT/abdera-1.2-20120417.000853-66.pom
ERROR: Failed to deploy artifacts: Could not transfer artifact org.apache.abdera:abdera:pom:1.2-20120417.000853-66
from/to  (https://repository.apache.org/content/repositories/snapshots): Failed to transfer
file: https://repository.apache.org/content/repositories/snapshots/org/apache/abdera/abdera/1.2-SNAPSHOT/abdera-1.2-20120417.000853-66.pom.
Return code is: 401, ReasonPhrase:Unauthorized.
org.apache.maven.artifact.deployer.ArtifactDeploymentException: Failed to deploy artifacts:
Could not transfer artifact org.apache.abdera:abdera:pom:1.2-20120417.000853-66 from/to  (https://repository.apache.org/content/repositories/snapshots):
Failed to transfer file: https://repository.apache.org/content/repositories/snapshots/org/apache/abdera/abdera/1.2-SNAPSHOT/abdera-1.2-20120417.000853-66.pom.
Return code is: 401, ReasonPhrase:Unauthorized.
	at org.apache.maven.artifact.deployer.DefaultArtifactDeployer.deploy(DefaultArtifactDeployer.java:141)
	at hudson.maven.reporters.MavenArtifactRecord.deploy(MavenArtifactRecord.java:182)
	at hudson.maven.RedeployPublisher.perform(RedeployPublisher.java:174)
	at hudson.tasks.BuildStepMonitor$1.perform(BuildStepMonitor.java:19)
	at hudson.model.AbstractBuild$AbstractRunner.perform(AbstractBuild.java:705)
	at hudson.model.AbstractBuild$AbstractRunner.performAllBuildSteps(AbstractBuild.java:680)
	at hudson.maven.MavenModuleSetBuild$RunnerImpl.post2(MavenModuleSetBuild.java:996)
	at hudson.model.AbstractBuild$AbstractRunner.post(AbstractBuild.java:627)
	at hudson.model.Run.run(Run.java:1438)
	at hudson.maven.MavenModuleSetBuild.run(MavenModuleSetBuild.java:479)
	at hudson.model.ResourceController.execute(ResourceController.java:88)
	at hudson.model.Executor.run(Executor.java:238)
Caused by: org.sonatype.aether.deployment.DeploymentException: Failed to deploy artifacts:
Could not transfer artifact org.apache.abdera:abdera:pom:1.2-20120417.000853-66 from/to  (https://repository.apache.org/content/repositories/snapshots):
Failed to transfer file: https://repository.apache.org/content/repositories/snapshots/org/apache/abdera/abdera/1.2-SNAPSHOT/abdera-1.2-20120417.000853-66.pom.
Return code is: 401, ReasonPhrase:Unauthorized.
	at org.sonatype.aether.impl.internal.DefaultDeployer.deploy(DefaultDeployer.java:280)
	at org.sonatype.aether.impl.internal.DefaultDeployer.deploy(DefaultDeployer.java:211)
	at org.sonatype.aether.impl.internal.DefaultRepositorySystem.deploy(DefaultRepositorySystem.java:443)
	at org.apache.maven.artifact.deployer.DefaultArtifactDeployer.deploy(DefaultArtifactDeployer.java:137)
	... 11 more
Caused by: org.sonatype.aether.transfer.ArtifactTransferException: Could not transfer artifact
org.apache.abdera:abdera:pom:1.2-20120417.000853-66 from/to  (https://repository.apache.org/content/repositories/snapshots):
Failed to transfer file: https://repository.apache.org/content/repositories/snapshots/org/apache/abdera/abdera/1.2-SNAPSHOT/abdera-1.2-20120417.000853-66.pom.
Return code is: 401, ReasonPhrase:Unauthorized.
	at org.sonatype.aether.connector.wagon.WagonRepositoryConnector$4.wrap(WagonRepositoryConnector.java:951)
	at org.sonatype.aether.connector.wagon.WagonRepositoryConnector$4.wrap(WagonRepositoryConnector.java:941)
	at org.sonatype.aether.connector.wagon.WagonRepositoryConnector$PutTask.run(WagonRepositoryConnector.java:837)
	at org.sonatype.aether.connector.wagon.WagonRepositoryConnector.put(WagonRepositoryConnector.java:467)
	at org.sonatype.aether.impl.internal.DefaultDeployer.deploy(DefaultDeployer.java:274)
	... 14 more
Caused by: org.apache.maven.wagon.TransferFailedException: Failed to transfer file: https://repository.apache.org/content/repositories/snapshots/org/apache/abdera/abdera/1.2-SNAPSHOT/abdera-1.2-20120417.000853-66.pom.
Return code is: 401, ReasonPhrase:Unauthorized.
	at org.apache.maven.wagon.shared.http4.AbstractHttpClientWagon.put(AbstractHttpClientWagon.java:562)
	at org.apache.maven.wagon.shared.http4.AbstractHttpClientWagon.put(AbstractHttpClientWagon.java:471)
	at org.apache.maven.wagon.shared.http4.AbstractHttpClientWagon.put(AbstractHttpClientWagon.java:451)
	at org.sonatype.aether.connector.wagon.WagonRepositoryConnector$PutTask.run(WagonRepositoryConnector.java:811)
	... 16 more
[INFO] Deployment failed after 1 min 42 sec
Build step 'Deploy artifacts to Maven repository' changed build result to FAILURE

Mime
View raw message