abdera-dev mailing list archives

Site index · List index
Message view « Date » · « Thread »
Top « Date » · « Thread »
From Apache Jenkins Server <jenk...@builds.apache.org>
Subject Build failed in Jenkins: Abdera-trunk #613
Date Thu, 05 Jan 2012 00:04:26 GMT
See <https://builds.apache.org/job/Abdera-trunk/613/>

------------------------------------------
[...truncated 3399 lines...]

[INFO] --- maven-clean-plugin:2.4.1:clean (default-clean) @ abdera-extensions-features ---
[INFO] 
[INFO] --- cobertura-maven-plugin:2.4:clean (default) @ abdera-extensions-features ---
[INFO] 
[INFO] --- maven-bundle-plugin:2.1.0:cleanVersions (default) @ abdera-extensions-features
---
[INFO] 
[INFO] --- maven-remote-resources-plugin:1.0:process (compile) @ abdera-extensions-features
---
[INFO] [INFO] Using 'UTF-8' encoding to copy filtered resources.

[INFO] --- maven-resources-plugin:2.4.3:resources (default-resources) @ abdera-extensions-features
---
[INFO] Copying 1 resource
[INFO] Copying 2 resources
[INFO] 
[INFO] --- maven-compiler-plugin:2.3.2:compile (default-compile) @ abdera-extensions-features
---
[INFO] Compiling 9 source files to <https://builds.apache.org/job/Abdera-trunk/ws/trunk/extensions/features/target/classes>
[INFO] Using 'UTF-8' encoding to copy filtered resources.
[INFO] 
[INFO] --- maven-resources-plugin:2.4.3:testResources (default-testResources) @ abdera-extensions-features
---
[INFO] Copying 0 resource
[INFO] Copying 2 resources
[INFO] 
[INFO] --- maven-compiler-plugin:2.3.2:testCompile (default-testCompile) @ abdera-extensions-features
---
[INFO] Compiling 2 source files to <https://builds.apache.org/job/Abdera-trunk/ws/trunk/extensions/features/target/test-classes>
[INFO] 
[INFO] --- maven-surefire-plugin:2.6:test (default-test) @ abdera-extensions-features ---[INFO]
Surefire report directory: <https://builds.apache.org/job/Abdera-trunk/ws/trunk/extensions/features/target/surefire-reports>


-------------------------------------------------------
 T E S T S
-------------------------------------------------------
Running org.apache.abdera.test.ext.features.FeatureTest
Tests run: 4, Failures: 0, Errors: 0, Skipped: 0, Time elapsed: 0.29 sec

Results :

Tests run: 4, Failures: 0, Errors: 0, Skipped: 0

[JENKINS] Recording test results
[INFO] 
[INFO] --- maven-jar-plugin:2.2:jar (default-jar) @ abdera-extensions-features ---
[INFO] Building jar: <https://builds.apache.org/job/Abdera-trunk/ws/trunk/extensions/features/target/abdera-extensions-features-1.2-SNAPSHOT.jar>
[INFO] 
[INFO] --- maven-bundle-plugin:2.1.0:cleanVersions (default) @ abdera-extensions-features
---
[JENKINS] Archiving <https://builds.apache.org/job/Abdera-trunk/ws/trunk/extensions/features/pom.xml>
to /home/hudson/hudson/jobs/Abdera-trunk/modules/org.apache.abdera$abdera-extensions-features/builds/2012-01-05_00-00-59/archive/org.apache.abdera/abdera-extensions-features/1.2-SNAPSHOT/abdera-extensions-features-1.2-SNAPSHOT.pom
[JENKINS] Archiving <https://builds.apache.org/job/Abdera-trunk/ws/trunk/extensions/features/target/abdera-extensions-features-1.2-SNAPSHOT.jar>
to /home/hudson/hudson/jobs/Abdera-trunk/modules/org.apache.abdera$abdera-extensions-features/builds/2012-01-05_00-00-59/archive/org.apache.abdera/abdera-extensions-features/1.2-SNAPSHOT/abdera-extensions-features-1.2-SNAPSHOT.jar
Jan 5, 2012 12:04:19 AM hudson.maven.ExecutedMojo <init>
WARNING: Failed to getClass for org.apache.maven.plugin.source.SourceJarMojo
[INFO] 
[INFO] --- maven-source-plugin:2.1.2:jar (attach-sources) @ abdera-extensions-features ---
[INFO] META-INF already added, skipping
[INFO] META-INF already added, skipping
[INFO] META-INF/NOTICE already added, skipping
[INFO] META-INF/LICENSE already added, skipping
[INFO] Building jar: <https://builds.apache.org/job/Abdera-trunk/ws/trunk/extensions/features/target/abdera-extensions-features-1.2-SNAPSHOT-sources.jar>
[INFO] META-INF already added, skipping
[INFO] META-INF already added, skipping
[INFO] META-INF/NOTICE already added, skipping
[INFO] META-INF/LICENSE already added, skipping
[INFO] [INFO] Installing <https://builds.apache.org/job/Abdera-trunk/ws/trunk/extensions/features/target/abdera-extensions-features-1.2-SNAPSHOT.jar>
to /home/jenkins/.m2/repository/org/apache/abdera/abdera-extensions-features/1.2-SNAPSHOT/abdera-extensions-features-1.2-SNAPSHOT.jar

[INFO] --- maven-install-plugin:2.3.1:install (default-install) @ abdera-extensions-features
---
[INFO] Installing <https://builds.apache.org/job/Abdera-trunk/ws/trunk/extensions/features/pom.xml>
to /home/jenkins/.m2/repository/org/apache/abdera/abdera-extensions-features/1.2-SNAPSHOT/abdera-extensions-features-1.2-SNAPSHOT.pom
[INFO] Installing <https://builds.apache.org/job/Abdera-trunk/ws/trunk/extensions/features/target/abdera-extensions-features-1.2-SNAPSHOT-sources.jar>
to /home/jenkins/.m2/repository/org/apache/abdera/abdera-extensions-features/1.2-SNAPSHOT/abdera-extensions-features-1.2-SNAPSHOT-sources.jar
[JENKINS] Archiving <https://builds.apache.org/job/Abdera-trunk/ws/trunk/extensions/features/target/abdera-extensions-features-1.2-SNAPSHOT-sources.jar>
to /home/hudson/hudson/jobs/Abdera-trunk/modules/org.apache.abdera$abdera-extensions-features/builds/2012-01-05_00-00-59/archive/org.apache.abdera/abdera-extensions-features/1.2-SNAPSHOT/abdera-extensions-features-1.2-SNAPSHOT-sources.jar
[INFO]                                                                         
[INFO] ------------------------------------------------------------------------[INFO] Deleting
<https://builds.apache.org/job/Abdera-trunk/ws/trunk/extensions/target>

[INFO] Building Abdera Extensions 1.2-SNAPSHOT
[INFO] ------------------------------------------------------------------------
[INFO] 
[INFO] --- maven-clean-plugin:2.4.1:clean (default-clean) @ abdera-extensions-parent ---
[INFO] 
[INFO] --- cobertura-maven-plugin:2.4:clean (default) @ abdera-extensions-parent ---
[INFO] 
[INFO] --- maven-bundle-plugin:2.1.0:cleanVersions (default) @ abdera-extensions-parent ---
[INFO] 
[INFO] --- maven-remote-resources-plugin:1.0:process (compile) @ abdera-extensions-parent
---
[INFO] 
[INFO] --- maven-bundle-plugin:2.1.0:cleanVersions (default) @ abdera-extensions-parent ---
[JENKINS] Archiving <https://builds.apache.org/job/Abdera-trunk/ws/trunk/extensions/pom.xml>
to /home/hudson/hudson/jobs/Abdera-trunk/modules/org.apache.abdera$abdera-extensions-parent/builds/2012-01-05_00-00-59/archive/org.apache.abdera/abdera-extensions-parent/1.2-SNAPSHOT/abdera-extensions-parent-1.2-SNAPSHOT.pom
Jan 5, 2012 12:04:20 AM hudson.maven.ExecutedMojo <init>
WARNING: Failed to getClass for org.apache.maven.plugin.source.SourceJarMojo
[INFO] 
[INFO] --- maven-source-plugin:2.1.2:jar (attach-sources) @ abdera-extensions-parent ---
[INFO] [INFO] Installing <https://builds.apache.org/job/Abdera-trunk/ws/trunk/extensions/pom.xml>
to /home/jenkins/.m2/repository/org/apache/abdera/abdera-extensions-parent/1.2-SNAPSHOT/abdera-extensions-parent-1.2-SNAPSHOT.pom

[INFO] --- maven-install-plugin:2.3.1:install (default-install) @ abdera-extensions-parent
---
[INFO]                                                                         
[INFO] ------------------------------------------------------------------------
[INFO] Building Abdera Examples 1.2-SNAPSHOT
[INFO] ------------------------------------------------------------------------
[INFO] [INFO] Deleting <https://builds.apache.org/job/Abdera-trunk/ws/trunk/examples/target>

[INFO] --- maven-clean-plugin:2.4.1:clean (default-clean) @ abdera-examples ---
[INFO] 
[INFO] --- cobertura-maven-plugin:2.4:clean (default) @ abdera-examples ---
[INFO] 
[INFO] --- maven-bundle-plugin:2.1.0:cleanVersions (default) @ abdera-examples ---
[INFO] 
[INFO] --- maven-remote-resources-plugin:1.0:process (compile) @ abdera-examples ---
[INFO] [INFO] Using 'UTF-8' encoding to copy filtered resources.

[INFO] --- maven-resources-plugin:2.4.3:resources (default-resources) @ abdera-examples ---
[INFO] Copying 10 resources
[INFO] Copying 2 resources
[INFO] 
[INFO] --- maven-compiler-plugin:2.3.2:compile (default-compile) @ abdera-examples ---
[INFO] Compiling 44 source files to <https://builds.apache.org/job/Abdera-trunk/ws/trunk/examples/target/classes>
[INFO] [INFO] Using 'UTF-8' encoding to copy filtered resources.
[INFO] skip non existing resourceDirectory <https://builds.apache.org/job/Abdera-trunk/ws/trunk/examples/src/test/resources>
[INFO] Copying 2 resources

[INFO] --- maven-resources-plugin:2.4.3:testResources (default-testResources) @ abdera-examples
---
[INFO] [INFO] No sources to compile

[INFO] --- maven-compiler-plugin:2.3.2:testCompile (default-testCompile) @ abdera-examples
---
[INFO] [INFO] Surefire report directory: <https://builds.apache.org/job/Abdera-trunk/ws/trunk/examples/target/surefire-reports>

[INFO] --- maven-surefire-plugin:2.6:test (default-test) @ abdera-examples ---

-------------------------------------------------------
 T E S T S
-------------------------------------------------------
There are no tests to run.

Results :

Tests run: 0, Failures: 0, Errors: 0, Skipped: 0

[JENKINS] Recording test results
[INFO] [INFO] Building jar: <https://builds.apache.org/job/Abdera-trunk/ws/trunk/examples/target/abdera-examples-1.2-SNAPSHOT.jar>

[INFO] --- maven-jar-plugin:2.2:jar (default-jar) @ abdera-examples ---
[INFO] 
[INFO] --- maven-bundle-plugin:2.1.0:cleanVersions (default) @ abdera-examples ---
[JENKINS] Archiving <https://builds.apache.org/job/Abdera-trunk/ws/trunk/examples/pom.xml>
to /home/hudson/hudson/jobs/Abdera-trunk/modules/org.apache.abdera$abdera-examples/builds/2012-01-05_00-00-59/archive/org.apache.abdera/abdera-examples/1.2-SNAPSHOT/abdera-examples-1.2-SNAPSHOT.pom
[JENKINS] Archiving <https://builds.apache.org/job/Abdera-trunk/ws/trunk/examples/target/abdera-examples-1.2-SNAPSHOT.jar>
to /home/hudson/hudson/jobs/Abdera-trunk/modules/org.apache.abdera$abdera-examples/builds/2012-01-05_00-00-59/archive/org.apache.abdera/abdera-examples/1.2-SNAPSHOT/abdera-examples-1.2-SNAPSHOT.jar
Jan 5, 2012 12:04:23 AM hudson.maven.ExecutedMojo <init>
WARNING: Failed to getClass for org.apache.maven.plugin.source.SourceJarMojo
[INFO] 
[INFO] --- maven-source-plugin:2.1.2:jar (attach-sources) @ abdera-examples ---
[INFO] META-INF already added, skipping
[INFO] org already added, skipping
[INFO] org/apache already added, skipping
[INFO] org/apache/abdera already added, skipping
[INFO] org/apache/abdera/examples already added, skipping
[INFO] org/apache/abdera/examples/appserver already added, skipping
[INFO] META-INF already added, skipping
[INFO] META-INF/NOTICE already added, skipping
[INFO] META-INF/LICENSE already added, skipping
[INFO] Building jar: <https://builds.apache.org/job/Abdera-trunk/ws/trunk/examples/target/abdera-examples-1.2-SNAPSHOT-sources.jar>
[INFO] META-INF already added, skipping
[INFO] org already added, skipping
[INFO] org/apache already added, skipping
[INFO] org/apache/abdera already added, skipping
[INFO] org/apache/abdera/examples already added, skipping
[INFO] org/apache/abdera/examples/appserver already added, skipping
[INFO] META-INF already added, skipping
[INFO] META-INF/NOTICE already added, skipping
[INFO] META-INF/LICENSE already added, skipping
[INFO] [INFO] Installing <https://builds.apache.org/job/Abdera-trunk/ws/trunk/examples/target/abdera-examples-1.2-SNAPSHOT.jar>
to /home/jenkins/.m2/repository/org/apache/abdera/abdera-examples/1.2-SNAPSHOT/abdera-examples-1.2-SNAPSHOT.jar

[INFO] --- maven-install-plugin:2.3.1:install (default-install) @ abdera-examples ---
[INFO] Installing <https://builds.apache.org/job/Abdera-trunk/ws/trunk/examples/pom.xml>
to /home/jenkins/.m2/repository/org/apache/abdera/abdera-examples/1.2-SNAPSHOT/abdera-examples-1.2-SNAPSHOT.pom
[INFO] Installing <https://builds.apache.org/job/Abdera-trunk/ws/trunk/examples/target/abdera-examples-1.2-SNAPSHOT-sources.jar>
to /home/jenkins/.m2/repository/org/apache/abdera/abdera-examples/1.2-SNAPSHOT/abdera-examples-1.2-SNAPSHOT-sources.jar
[JENKINS] Archiving <https://builds.apache.org/job/Abdera-trunk/ws/trunk/examples/target/abdera-examples-1.2-SNAPSHOT-sources.jar>
to /home/hudson/hudson/jobs/Abdera-trunk/modules/org.apache.abdera$abdera-examples/builds/2012-01-05_00-00-59/archive/org.apache.abdera/abdera-examples/1.2-SNAPSHOT/abdera-examples-1.2-SNAPSHOT-sources.jar
[INFO] ------------------------------------------------------------------------
[INFO] Reactor Summary:
[INFO] 
[INFO] Apache Abdera ..................................... SUCCESS [9.632s]
[INFO] I18N Libraries .................................... SUCCESS [13.823s]
[INFO] Abdera Core ....................................... SUCCESS [7.093s]
[INFO] Abdera Parser ..................................... SUCCESS [10.244s]
[INFO] Abdera Client ..................................... SUCCESS [6.825s]
[INFO] Abdera Server ..................................... SUCCESS [8.754s]
[INFO] Abdera Spring Integration ......................... SUCCESS [5.591s]
[INFO] Abdera Adapters ................................... SUCCESS [0.852s]
[INFO] Abdera JCR Adapter ................................ SUCCESS [10.727s]
[INFO] Abdera Filesystem Adapter ......................... SUCCESS [5.002s]
[INFO] Abdera JDBC Adapter ............................... SUCCESS [4.575s]
[INFO] Abdera Security ................................... SUCCESS [7.145s]
[INFO] Abdera Extensions - GData ......................... SUCCESS [6.485s]
[INFO] Abdera Extensions - Geo ........................... SUCCESS [4.785s]
[INFO] Abdera Extensions - HTML .......................... SUCCESS [4.785s]
[INFO] Abdera Extensions - Main .......................... SUCCESS [5.647s]
[INFO] Abdera Extensions - JSON .......................... SUCCESS [5.575s]
[INFO] Abdera Extensions - Media ......................... SUCCESS [5.935s]
[INFO] Abdera Extensions - OAuth ......................... SUCCESS [23.255s]
[INFO] Abdera Extensions - OpenSearch .................... SUCCESS [8.180s]
[INFO] Abdera Extensions - Serializer .................... SUCCESS [6.452s]
[INFO] Abdera Extensions - Sharing ....................... SUCCESS [6.060s]
[INFO] Abdera Extensions - WSSE .......................... SUCCESS [4.864s]
[INFO] Abdera Bundle Jar ................................. SUCCESS [6.954s]
[INFO] Abdera Extensions - RSS ........................... SUCCESS [6.884s]
[INFO] Abdera Extensions - Features ...................... SUCCESS [3.237s]
[INFO] Abdera Extensions ................................. SUCCESS [0.409s]
[INFO] Abdera Examples ................................... SUCCESS [3.820s]
[INFO] ------------------------------------------------------------------------
[INFO] BUILD SUCCESS
[INFO] ------------------------------------------------------------------------
[INFO] Total time: 3:21.993s
[INFO] Finished at: Thu Jan 05 00:04:25 GMT 2012
[INFO] Final Memory: 69M/746M
[INFO] ------------------------------------------------------------------------
channel stopped
Maven RedeployPublished use remote ubuntu3 maven settings from : /home/jenkins/.m2/settings.xml
[ERROR] uniqueVersion == false is not anymore supported in maven 3
[INFO] Deployment in https://repository.apache.org/content/repositories/snapshots (id=,uniqueVersion=false)
Deploying the main artifact abdera-1.2-SNAPSHOT.pom
Downloading: https://repository.apache.org/content/repositories/snapshots/org/apache/abdera/abdera/1.2-SNAPSHOT/maven-metadata.xml
Downloaded: https://repository.apache.org/content/repositories/snapshots/org/apache/abdera/abdera/1.2-SNAPSHOT/maven-metadata.xml
(598 B at 4.3 KB/sec)
Uploading: https://repository.apache.org/content/repositories/snapshots/org/apache/abdera/abdera/1.2-SNAPSHOT/abdera-1.2-20120105.000426-66.pom
Uploading: https://repository.apache.org/content/repositories/snapshots/org/apache/abdera/abdera/1.2-SNAPSHOT/abdera-1.2-20120105.000426-66.pom
ERROR: Failed to deploy artifacts: Could not transfer artifact org.apache.abdera:abdera:pom:1.2-20120105.000426-66
from/to  (https://repository.apache.org/content/repositories/snapshots): Failed to transfer
file: https://repository.apache.org/content/repositories/snapshots/org/apache/abdera/abdera/1.2-SNAPSHOT/abdera-1.2-20120105.000426-66.pom.
Return code is: 401, ReasonPhrase:Unauthorized.
org.apache.maven.artifact.deployer.ArtifactDeploymentException: Failed to deploy artifacts:
Could not transfer artifact org.apache.abdera:abdera:pom:1.2-20120105.000426-66 from/to  (https://repository.apache.org/content/repositories/snapshots):
Failed to transfer file: https://repository.apache.org/content/repositories/snapshots/org/apache/abdera/abdera/1.2-SNAPSHOT/abdera-1.2-20120105.000426-66.pom.
Return code is: 401, ReasonPhrase:Unauthorized.
	at org.apache.maven.artifact.deployer.DefaultArtifactDeployer.deploy(DefaultArtifactDeployer.java:141)
	at hudson.maven.reporters.MavenArtifactRecord.deploy(MavenArtifactRecord.java:182)
	at hudson.maven.RedeployPublisher.perform(RedeployPublisher.java:158)
	at hudson.tasks.BuildStepMonitor$1.perform(BuildStepMonitor.java:19)
	at hudson.model.AbstractBuild$AbstractRunner.perform(AbstractBuild.java:697)
	at hudson.model.AbstractBuild$AbstractRunner.performAllBuildSteps(AbstractBuild.java:672)
	at hudson.maven.MavenModuleSetBuild$RunnerImpl.post2(MavenModuleSetBuild.java:997)
	at hudson.model.AbstractBuild$AbstractRunner.post(AbstractBuild.java:619)
	at hudson.model.Run.run(Run.java:1429)
	at hudson.maven.MavenModuleSetBuild.run(MavenModuleSetBuild.java:481)
	at hudson.model.ResourceController.execute(ResourceController.java:88)
	at hudson.model.Executor.run(Executor.java:238)
Caused by: org.sonatype.aether.deployment.DeploymentException: Failed to deploy artifacts:
Could not transfer artifact org.apache.abdera:abdera:pom:1.2-20120105.000426-66 from/to  (https://repository.apache.org/content/repositories/snapshots):
Failed to transfer file: https://repository.apache.org/content/repositories/snapshots/org/apache/abdera/abdera/1.2-SNAPSHOT/abdera-1.2-20120105.000426-66.pom.
Return code is: 401, ReasonPhrase:Unauthorized.
	at org.sonatype.aether.impl.internal.DefaultDeployer.deploy(DefaultDeployer.java:280)
	at org.sonatype.aether.impl.internal.DefaultDeployer.deploy(DefaultDeployer.java:211)
	at org.sonatype.aether.impl.internal.DefaultRepositorySystem.deploy(DefaultRepositorySystem.java:443)
	at org.apache.maven.artifact.deployer.DefaultArtifactDeployer.deploy(DefaultArtifactDeployer.java:137)
	... 11 more
Caused by: org.sonatype.aether.transfer.ArtifactTransferException: Could not transfer artifact
org.apache.abdera:abdera:pom:1.2-20120105.000426-66 from/to  (https://repository.apache.org/content/repositories/snapshots):
Failed to transfer file: https://repository.apache.org/content/repositories/snapshots/org/apache/abdera/abdera/1.2-SNAPSHOT/abdera-1.2-20120105.000426-66.pom.
Return code is: 401, ReasonPhrase:Unauthorized.
	at org.sonatype.aether.connector.wagon.WagonRepositoryConnector$4.wrap(WagonRepositoryConnector.java:950)
	at org.sonatype.aether.connector.wagon.WagonRepositoryConnector$4.wrap(WagonRepositoryConnector.java:940)
	at org.sonatype.aether.connector.wagon.WagonRepositoryConnector$PutTask.run(WagonRepositoryConnector.java:837)
	at org.sonatype.aether.connector.wagon.WagonRepositoryConnector.put(WagonRepositoryConnector.java:467)
	at org.sonatype.aether.impl.internal.DefaultDeployer.deploy(DefaultDeployer.java:274)
	... 14 more
Caused by: org.apache.maven.wagon.TransferFailedException: Failed to transfer file: https://repository.apache.org/content/repositories/snapshots/org/apache/abdera/abdera/1.2-SNAPSHOT/abdera-1.2-20120105.000426-66.pom.
Return code is: 401, ReasonPhrase:Unauthorized.
	at org.apache.maven.wagon.shared.http4.AbstractHttpClientWagon.put(AbstractHttpClientWagon.java:562)
	at org.apache.maven.wagon.shared.http4.AbstractHttpClientWagon.put(AbstractHttpClientWagon.java:471)
	at org.apache.maven.wagon.shared.http4.AbstractHttpClientWagon.put(AbstractHttpClientWagon.java:451)
	at org.sonatype.aether.connector.wagon.WagonRepositoryConnector$PutTask.run(WagonRepositoryConnector.java:811)
	... 16 more
[INFO] Deployment failed after 0.42 sec
Build step 'Deploy artifacts to Maven repository' changed build result to FAILURE


Mime
View raw message