abdera-dev mailing list archives

Site index · List index
Message view « Date » · « Thread »
Top « Date » · « Thread »
From Apache Jenkins Server <jenk...@builds.apache.org>
Subject Build failed in Jenkins: Abdera2-trunk #113
Date Wed, 04 Jan 2012 00:02:05 GMT
See <https://builds.apache.org/job/Abdera2-trunk/113/changes>

Changes:

[jmsnell] Documentation

[jmsnell] Documentation, some usability improvements, bug fix

[jmsnell] A few usability updates... some of this will likely change soon. The Guava Library
is now up to version 11, which introduces some new functionality that duplicates some of the
utility stuff I've done here.

[jmsnell] missed something on the immutable mime type impl...

[jmsnell] bug fix... (glad I caught this one, would've been embarrassing lol)

[jmsnell] few minor changes to make working with async requests easier to work with

------------------------------------------
Started by timer
Building remotely on ubuntu3
Updating https://svn.apache.org/repos/asf/abdera/abdera2
U         activities/src/main/java/org/apache/abdera2/activities/client/ActivitiesClient.java
U         activities/src/main/java/org/apache/abdera2/activities/client/ActivitiesSession.java
U         common/src/main/java/org/apache/abdera2/common/http/Authentication.java
U         common/src/main/java/org/apache/abdera2/common/http/ResponseType.java
U         common/src/main/java/org/apache/abdera2/common/mediatype/MimeTypeHelper.java
U         common/src/main/java/org/apache/abdera2/common/text/NormalizationForm.java
U         common/src/main/java/org/apache/abdera2/common/text/CharUtils.java
U         common/src/main/java/org/apache/abdera2/common/misc/MoreFunctions.java
AU        docs/Getting.Started/client.xml
U         client/src/main/java/org/apache/abdera2/protocol/client/ClientResponseImpl.java
U         client/src/main/java/org/apache/abdera2/protocol/client/ClientWrapper.java
U         client/src/main/java/org/apache/abdera2/protocol/client/BasicClient.java
U         client/src/main/java/org/apache/abdera2/protocol/client/Client.java
At revision 1226997
Parsing POMs
[abdera2] $ /home/hudson/tools/java/latest1.6/bin/java -Xmx756m -Xms756m -XX:MaxPermSize=512m
-cp /home/jenkins/jenkins-slave/maven3-agent.jar:/home/hudson/tools/maven/latest3/boot/plexus-classworlds-2.4.jar
org.jvnet.hudson.maven3.agent.Maven3Main /home/hudson/tools/maven/latest3 /x1/jenkins/jenkins-slave/slave.jar
/home/jenkins/jenkins-slave/maven3-interceptor.jar 44460
<===[JENKINS REMOTING CAPACITY]===>   channel started
Executing Maven:  -B -f <https://builds.apache.org/job/Abdera2-trunk/ws/abdera2/pom.xml>
clean install -U
[INFO] [WARNING] 
[WARNING] Some problems were encountered while building the effective model for org.apache.abdera2:abdera2-common:bundle:2.0-SNAPSHOT
[WARNING] 'dependencies.dependency.scope' for junit:junit:jar must be one of [provided, compile,
runtime, test, system] but is 'test, compile, package'. @ org.apache.abdera2:abdera2:2.0-SNAPSHOT,
<https://builds.apache.org/job/Abdera2-trunk/ws/abdera2/pom.xml,> line 623, column 16
[WARNING] 
[WARNING] Some problems were encountered while building the effective model for org.apache.abdera2:abdera2-core:bundle:2.0-SNAPSHOT
[WARNING] 'dependencies.dependency.scope' for junit:junit:jar must be one of [provided, compile,
runtime, test, system] but is 'test, compile, package'. @ org.apache.abdera2:abdera2:2.0-SNAPSHOT,
<https://builds.apache.org/job/Abdera2-trunk/ws/abdera2/pom.xml,> line 623, column 16
[WARNING] 
[WARNING] Some problems were encountered while building the effective model for org.apache.abdera2:abdera2-server:bundle:2.0-SNAPSHOT
[WARNING] 'dependencies.dependency.scope' for junit:junit:jar must be one of [provided, compile,
runtime, test, system] but is 'test, compile, package'. @ org.apache.abdera2:abdera2:2.0-SNAPSHOT,
<https://builds.apache.org/job/Abdera2-trunk/ws/abdera2/pom.xml,> line 623, column 16
[WARNING] 
[WARNING] Some problems were encountered while building the effective model for org.apache.abdera2:abdera2-activities:bundle:2.0-SNAPSHOT
[WARNING] 'dependencies.dependency.scope' for junit:junit:jar must be one of [provided, compile,
runtime, test, system] but is 'test, compile, package'. @ org.apache.abdera2:abdera2:2.0-SNAPSHOT,
<https://builds.apache.org/job/Abdera2-trunk/ws/abdera2/pom.xml,> line 623, column 16
[WARNING] 
[WARNING] Some problems were encountered while building the effective model for org.apache.abdera2:abdera2-client:bundle:2.0-SNAPSHOT
[WARNING] 'dependencies.dependency.scope' for junit:junit:jar must be one of [provided, compile,
runtime, test, system] but is 'test, compile, package'. @ org.apache.abdera2:abdera2:2.0-SNAPSHOT,
<https://builds.apache.org/job/Abdera2-trunk/ws/abdera2/pom.xml,> line 623, column 16
[WARNING] 
[WARNING] Some problems were encountered while building the effective model for org.apache.abdera2:abdera2-ext:bundle:2.0-SNAPSHOT
[WARNING] 'dependencies.dependency.scope' for junit:junit:jar must be one of [provided, compile,
runtime, test, system] but is 'test, compile, package'. @ org.apache.abdera2:abdera2:2.0-SNAPSHOT,
<https://builds.apache.org/job/Abdera2-trunk/ws/abdera2/pom.xml,> line 623, column 16
[WARNING] 
[WARNING] Some problems were encountered while building the effective model for org.apache.abdera2:abdera2-security:bundle:2.0-SNAPSHOT
[WARNING] 'dependencies.dependency.scope' for junit:junit:jar must be one of [provided, compile,
runtime, test, system] but is 'test, compile, package'. @ org.apache.abdera2:abdera2:2.0-SNAPSHOT,
<https://builds.apache.org/job/Abdera2-trunk/ws/abdera2/pom.xml,> line 623, column 16
[WARNING] 
Scanning for projects...[WARNING] Some problems were encountered while building the effective
model for org.apache.abdera2:abdera-examples:jar:2.0-SNAPSHOT

[INFO] ------------------------------------------------------------------------
[INFO] Reactor Build Order:
[WARNING] 'dependencies.dependency.scope' for junit:junit:jar must be one of [provided, compile,
runtime, test, system] but is 'test, compile, package'. @ org.apache.abdera2:abdera2:2.0-SNAPSHOT,
<https://builds.apache.org/job/Abdera2-trunk/ws/abdera2/pom.xml,> line 458, column 16
[WARNING] 
[INFO] 
[WARNING] Some problems were encountered while building the effective model for org.apache.abdera2:abdera2:pom:2.0-SNAPSHOT
[INFO] Apache Abdera2
[INFO] [WARNING] 'dependencies.dependency.scope' for junit:junit:jar must be one of [provided,
compile, runtime, test, system] but is 'test, compile, package'. @ line 623, column 16
Abdera2 Common Library
[WARNING] 
[INFO] Abdera2 Client[WARNING] It is highly recommended to fix these problems because they
threaten the stability of your build.

[WARNING] 
[INFO] [WARNING] For this reason, future Maven versions might no longer support building such
malformed projects.
Abdera2 Core[WARNING] 

[INFO] Abdera2 Server
[INFO] Abdera2 Activities
[INFO] Abdera2 Extensions
[INFO] Abdera2 Security
[INFO] Abdera2 Tests
[INFO] Abdera Examples
[INFO]                                                                         
[INFO] ------------------------------------------------------------------------
[INFO] Building Apache Abdera2 2.0-SNAPSHOT
[INFO] ------------------------------------------------------------------------
[WARNING] The artifact xml-apis:xml-apis:jar:2.0.2 has been relocated to xml-apis:xml-apis:jar:1.0.b2
[INFO] 
[INFO] --- maven-clean-plugin:2.4.1:clean (default-clean) @ abdera2 ---
[INFO] Deleting <https://builds.apache.org/job/Abdera2-trunk/ws/abdera2/target>
log4j:WARN No appenders could be found for logger (org.apache.commons.beanutils.converters.BooleanConverter).
log4j:WARN Please initialize the log4j system properly.
[INFO] 
[INFO] --- cobertura-maven-plugin:2.4:clean (default) @ abdera2 ---
[INFO] 
[INFO] --- maven-bundle-plugin:2.1.0:cleanVersions (default) @ abdera2 ---
[INFO] 
[INFO] --- maven-remote-resources-plugin:1.0:process (compile) @ abdera2 ---
[INFO] Setting property: classpath.resource.loader.class => 'org.codehaus.plexus.velocity.ContextClassLoaderResourceLoader'.
[INFO] Setting property: velocimacro.messages.on => 'false'.
[INFO] Setting property: resource.loader => 'classpath'.
[INFO] Setting property: resource.manager.logwhenfound => 'false'.
[INFO] 
[INFO] --- maven-bundle-plugin:2.1.0:cleanVersions (default) @ abdera2 ---
[JENKINS] Archiving <https://builds.apache.org/job/Abdera2-trunk/ws/abdera2/pom.xml>
to /home/hudson/hudson/jobs/Abdera2-trunk/modules/org.apache.abdera2$abdera2/builds/2012-01-04_00-00-43/archive/org.apache.abdera2/abdera2/2.0-SNAPSHOT/abdera2-2.0-SNAPSHOT.pom
Jan 4, 2012 12:01:52 AM hudson.maven.ExecutedMojo <init>
WARNING: Failed to getClass for org.apache.maven.plugin.source.SourceJarMojo
[INFO] 
[INFO] --- maven-source-plugin:2.1.2:jar (attach-sources) @ abdera2 ---
[INFO] 
[INFO] --- maven-install-plugin:2.3.1:install (default-install) @ abdera2 ---
[INFO] Installing <https://builds.apache.org/job/Abdera2-trunk/ws/abdera2/pom.xml> to
/home/jenkins/.m2/repository/org/apache/abdera2/abdera2/2.0-SNAPSHOT/abdera2-2.0-SNAPSHOT.pom
[INFO]                                                                         
[INFO] ------------------------------------------------------------------------
[INFO] Building Abdera2 Common Library 2.0-SNAPSHOT
[INFO] ------------------------------------------------------------------------
Downloading: http://repo1.maven.org/maven2/org/apache/maven/plugins/maven-install-plugin/maven-metadata.xml
Downloaded: http://repo1.maven.org/maven2/org/apache/maven/plugins/maven-install-plugin/maven-metadata.xml
(503 B at 1.3 KB/sec)
Downloading: http://repo1.maven.org/maven2/org/apache/maven/plugins/maven-resources-plugin/maven-metadata.xml
Downloaded: http://repo1.maven.org/maven2/org/apache/maven/plugins/maven-resources-plugin/maven-metadata.xml
(657 B at 1.3 KB/sec)
Downloading: http://repo1.maven.org/maven2/org/apache/maven/plugins/maven-deploy-plugin/maven-metadata.xml
Downloaded: http://repo1.maven.org/maven2/org/apache/maven/plugins/maven-deploy-plugin/maven-metadata.xml
(614 B at 1.2 KB/sec)
[WARNING] The artifact xml-apis:xml-apis:jar:2.0.2 has been relocated to xml-apis:xml-apis:jar:1.0.b2
[INFO] [INFO] Deleting <https://builds.apache.org/job/Abdera2-trunk/ws/abdera2/common/target>

[INFO] --- maven-clean-plugin:2.4.1:clean (default-clean) @ abdera2-common ---
[INFO] 
[INFO] --- cobertura-maven-plugin:2.4:clean (default) @ abdera2-common ---
[INFO] 
[INFO] --- maven-bundle-plugin:2.1.0:cleanVersions (default) @ abdera2-common ---
[INFO] 
[INFO] --- maven-remote-resources-plugin:1.0:process (compile) @ abdera2-common ---
[INFO] 
[INFO] --- maven-resources-plugin:2.5:resources (default-resources) @ abdera2-common ---
[debug] execute contextualize
[INFO] Using 'UTF-8' encoding to copy filtered resources.
[INFO] Copying 0 resource
[INFO] Copying 2 resources
[INFO] 
[INFO] --- maven-compiler-plugin:2.3.2:compile (default-compile) @ abdera2-common ---
[INFO] Compiling 178 source files to <https://builds.apache.org/job/Abdera2-trunk/ws/abdera2/common/target/classes>
[INFO] -------------------------------------------------------------
[ERROR] COMPILATION ERROR : 
[INFO] -------------------------------------------------------------
[ERROR] <https://builds.apache.org/job/Abdera2-trunk/ws/abdera2/common/src/main/java/org/apache/abdera2/common/lang/SubtagSet.java>:[148,8]
cannot find symbol
symbol  : method addAll(org.apache.abdera2.common.lang.SubtagSet)
location: class org.apache.abdera2.common.misc.ArrayBuilder<java.lang.Object>
[INFO] 1 error
[INFO] -------------------------------------------------------------
[JENKINS] Archiving <https://builds.apache.org/job/Abdera2-trunk/ws/abdera2/common/pom.xml>
to /home/hudson/hudson/jobs/Abdera2-trunk/modules/org.apache.abdera2$abdera2-common/builds/2012-01-04_00-00-43/archive/org.apache.abdera2/abdera2-common/2.0-SNAPSHOT/abdera2-common-2.0-SNAPSHOT.pom
[INFO] ------------------------------------------------------------------------
[INFO] Reactor Summary:
[INFO] 
[INFO] Apache Abdera2 .................................... SUCCESS [55.164s]
[INFO] Abdera2 Common Library ............................ FAILURE [11.086s]
[INFO] Abdera2 Client .................................... SKIPPED
[INFO] Abdera2 Core ...................................... SKIPPED
[INFO] Abdera2 Server .................................... SKIPPED
[INFO] Abdera2 Activities ................................ SKIPPED
[INFO] Abdera2 Extensions ................................ SKIPPED
[INFO] Abdera2 Security .................................. SKIPPED
[INFO] Abdera2 Tests ..................................... SKIPPED
[INFO] Abdera Examples ................................... SKIPPED
[INFO] ------------------------------------------------------------------------
[INFO] BUILD FAILURE
[INFO] ------------------------------------------------------------------------
[INFO] Total time: 1:06.973s
[INFO] Finished at: Wed Jan 04 00:02:04 UTC 2012
[INFO] Final Memory: 20M/724M
[INFO] ------------------------------------------------------------------------
Waiting for Jenkins to finish collecting data
mavenExecutionResult exceptions not empty
message : Failed to execute goal org.apache.maven.plugins:maven-compiler-plugin:2.3.2:compile
(default-compile) on project abdera2-common: Compilation failure
<https://builds.apache.org/job/Abdera2-trunk/ws/abdera2/common/src/main/java/org/apache/abdera2/common/lang/SubtagSet.java>:[148,8]
cannot find symbol
symbol  : method addAll(org.apache.abdera2.common.lang.SubtagSet)
location: class org.apache.abdera2.common.misc.ArrayBuilder<java.lang.Object>

cause : Compilation failure
<https://builds.apache.org/job/Abdera2-trunk/ws/abdera2/common/src/main/java/org/apache/abdera2/common/lang/SubtagSet.java>:[148,8]
cannot find symbol
symbol  : method addAll(org.apache.abdera2.common.lang.SubtagSet)
location: class org.apache.abdera2.common.misc.ArrayBuilder<java.lang.Object>

Stack trace : 
org.apache.maven.lifecycle.LifecycleExecutionException: Failed to execute goal org.apache.maven.plugins:maven-compiler-plugin:2.3.2:compile
(default-compile) on project abdera2-common: Compilation failure
<https://builds.apache.org/job/Abdera2-trunk/ws/abdera2/common/src/main/java/org/apache/abdera2/common/lang/SubtagSet.java>:[148,8]
cannot find symbol
symbol  : method addAll(org.apache.abdera2.common.lang.SubtagSet)
location: class org.apache.abdera2.common.misc.ArrayBuilder<java.lang.Object>

	at org.apache.maven.lifecycle.internal.MojoExecutor.execute(MojoExecutor.java:213)
	at org.apache.maven.lifecycle.internal.MojoExecutor.execute(MojoExecutor.java:153)
	at org.apache.maven.lifecycle.internal.MojoExecutor.execute(MojoExecutor.java:145)
	at org.apache.maven.lifecycle.internal.LifecycleModuleBuilder.buildProject(LifecycleModuleBuilder.java:84)
	at org.apache.maven.lifecycle.internal.LifecycleModuleBuilder.buildProject(LifecycleModuleBuilder.java:59)
	at org.apache.maven.lifecycle.internal.LifecycleStarter.singleThreadedBuild(LifecycleStarter.java:183)
	at org.apache.maven.lifecycle.internal.LifecycleStarter.execute(LifecycleStarter.java:161)
	at org.apache.maven.DefaultMaven.doExecute(DefaultMaven.java:319)
	at org.apache.maven.DefaultMaven.execute(DefaultMaven.java:156)
	at org.jvnet.hudson.maven3.launcher.Maven3Launcher.main(Maven3Launcher.java:79)
	at sun.reflect.NativeMethodAccessorImpl.invoke0(Native Method)
	at sun.reflect.NativeMethodAccessorImpl.invoke(NativeMethodAccessorImpl.java:39)
	at sun.reflect.DelegatingMethodAccessorImpl.invoke(DelegatingMethodAccessorImpl.java:25)
	at java.lang.reflect.Method.invoke(Method.java:597)
	at org.codehaus.plexus.classworlds.launcher.Launcher.launchStandard(Launcher.java:329)
	at org.codehaus.plexus.classworlds.launcher.Launcher.launch(Launcher.java:239)
	at org.jvnet.hudson.maven3.agent.Maven3Main.launch(Maven3Main.java:158)
	at hudson.maven.Maven3Builder.call(Maven3Builder.java:104)
	at hudson.maven.Maven3Builder.call(Maven3Builder.java:70)
	at hudson.remoting.UserRequest.perform(UserRequest.java:118)
	at hudson.remoting.UserRequest.perform(UserRequest.java:48)
	at hudson.remoting.Request$2.run(Request.java:287)
	at java.util.concurrent.Executors$RunnableAdapter.call(Executors.java:441)
	at java.util.concurrent.FutureTask$Sync.innerRun(FutureTask.java:303)
	at java.util.concurrent.FutureTask.run(FutureTask.java:138)
	at java.util.concurrent.ThreadPoolExecutor$Worker.runTask(ThreadPoolExecutor.java:886)
	at java.util.concurrent.ThreadPoolExecutor$Worker.run(ThreadPoolExecutor.java:908)
	at java.lang.Thread.run(Thread.java:662)
Caused by: org.apache.maven.plugin.CompilationFailureException: Compilation failure
<https://builds.apache.org/job/Abdera2-trunk/ws/abdera2/common/src/main/java/org/apache/abdera2/common/lang/SubtagSet.java>:[148,8]
cannot find symbol
symbol  : method addAll(org.apache.abdera2.common.lang.SubtagSet)
location: class org.apache.abdera2.common.misc.ArrayBuilder<java.lang.Object>

	at org.apache.maven.plugin.AbstractCompilerMojo.execute(AbstractCompilerMojo.java:656)
	at org.apache.maven.plugin.CompilerMojo.execute(CompilerMojo.java:128)
	at org.apache.maven.plugin.DefaultBuildPluginManager.executeMojo(DefaultBuildPluginManager.java:101)
	at org.apache.maven.lifecycle.internal.MojoExecutor.execute(MojoExecutor.java:209)
	... 27 more
channel stopped


Mime
View raw message