abdera-dev mailing list archives

Site index · List index
Message view « Date » · « Thread »
Top « Date » · « Thread »
From Apache Jenkins Server <jenk...@builds.apache.org>
Subject Build failed in Jenkins: Abdera2-trunk #81
Date Fri, 02 Dec 2011 00:02:02 GMT
See <https://builds.apache.org/job/Abdera2-trunk/81/changes>

Changes:

[jmsnell] remove unused imports

[jmsnell] bad import..

[jmsnell] quick optimization

[jmsnell] The activity streams implementation includes a number of non-standard experimental
features... to differentiate these from the core standard features, this checkin creates a
new experimental mode on the Builders that must be set prior to building Activity objects
that use the experimental features.

[jmsnell] Additional minor updates to objects.. just general cleanup at this point....

[jmsnell] A few minor updates to a couple of the object types

------------------------------------------
[...truncated 248 lines...]
[ERROR] <https://builds.apache.org/job/Abdera2-trunk/ws/abdera2/core/src/main/java/org/apache/abdera2/protocol/client/AbderaSession.java>:[120,108]
cannot find symbol
symbol  : class RequestOptions
location: class org.apache.abdera2.protocol.client.AbderaSession
[ERROR] <https://builds.apache.org/job/Abdera2-trunk/ws/abdera2/core/src/main/java/org/apache/abdera2/protocol/client/AbderaSession.java>:[131,22]
cannot find symbol
symbol  : class ClientResponse
location: class org.apache.abdera2.protocol.client.AbderaSession
[ERROR] <https://builds.apache.org/job/Abdera2-trunk/ws/abdera2/core/src/main/java/org/apache/abdera2/protocol/client/AbderaSession.java>:[134,6]
cannot find symbol
symbol  : class RequestOptions
location: class org.apache.abdera2.protocol.client.AbderaSession
[ERROR] <https://builds.apache.org/job/Abdera2-trunk/ws/abdera2/core/src/main/java/org/apache/abdera2/protocol/client/AbderaSession.java>:[161,22]
cannot find symbol
symbol  : class ClientResponse
location: class org.apache.abdera2.protocol.client.AbderaSession
[ERROR] <https://builds.apache.org/job/Abdera2-trunk/ws/abdera2/core/src/main/java/org/apache/abdera2/protocol/client/AbderaSession.java>:[161,66]
cannot find symbol
symbol  : class RequestOptions
location: class org.apache.abdera2.protocol.client.AbderaSession
[ERROR] <https://builds.apache.org/job/Abdera2-trunk/ws/abdera2/core/src/main/java/org/apache/abdera2/protocol/client/AbderaSession.java>:[186,22]
cannot find symbol
symbol  : class ClientResponse
location: class org.apache.abdera2.protocol.client.AbderaSession
[ERROR] <https://builds.apache.org/job/Abdera2-trunk/ws/abdera2/core/src/main/java/org/apache/abdera2/protocol/client/AbderaSession.java>:[196,22]
cannot find symbol
symbol  : class ClientResponse
location: class org.apache.abdera2.protocol.client.AbderaSession
[ERROR] <https://builds.apache.org/job/Abdera2-trunk/ws/abdera2/core/src/main/java/org/apache/abdera2/protocol/client/AbderaSession.java>:[206,22]
cannot find symbol
symbol  : class ClientResponse
location: class org.apache.abdera2.protocol.client.AbderaSession
[ERROR] <https://builds.apache.org/job/Abdera2-trunk/ws/abdera2/core/src/main/java/org/apache/abdera2/protocol/client/AbderaSession.java>:[216,22]
cannot find symbol
symbol  : class ClientResponse
location: class org.apache.abdera2.protocol.client.AbderaSession
[ERROR] <https://builds.apache.org/job/Abdera2-trunk/ws/abdera2/core/src/main/java/org/apache/abdera2/protocol/client/AbderaSession.java>:[229,22]
cannot find symbol
symbol  : class ClientResponse
location: class org.apache.abdera2.protocol.client.AbderaSession
[ERROR] <https://builds.apache.org/job/Abdera2-trunk/ws/abdera2/core/src/main/java/org/apache/abdera2/protocol/client/AbderaSession.java>:[233,8]
cannot find symbol
symbol  : class RequestOptions
location: class org.apache.abdera2.protocol.client.AbderaSession
[ERROR] <https://builds.apache.org/job/Abdera2-trunk/ws/abdera2/core/src/main/java/org/apache/abdera2/protocol/client/AbderaSession.java>:[250,22]
cannot find symbol
symbol  : class ClientResponse
location: class org.apache.abdera2.protocol.client.AbderaSession
[ERROR] <https://builds.apache.org/job/Abdera2-trunk/ws/abdera2/core/src/main/java/org/apache/abdera2/protocol/client/AbderaSession.java>:[254,8]
cannot find symbol
symbol  : class RequestOptions
location: class org.apache.abdera2.protocol.client.AbderaSession
[ERROR] <https://builds.apache.org/job/Abdera2-trunk/ws/abdera2/core/src/main/java/org/apache/abdera2/protocol/client/AbderaSession.java>:[271,22]
cannot find symbol
symbol  : class ClientResponse
location: class org.apache.abdera2.protocol.client.AbderaSession
[ERROR] <https://builds.apache.org/job/Abdera2-trunk/ws/abdera2/core/src/main/java/org/apache/abdera2/protocol/client/AbderaSession.java>:[274,8]
cannot find symbol
symbol  : class RequestOptions
location: class org.apache.abdera2.protocol.client.AbderaSession
[ERROR] <https://builds.apache.org/job/Abdera2-trunk/ws/abdera2/core/src/main/java/org/apache/abdera2/protocol/client/AbderaSession.java>:[293,22]
cannot find symbol
symbol  : class ClientResponse
location: class org.apache.abdera2.protocol.client.AbderaSession
[ERROR] <https://builds.apache.org/job/Abdera2-trunk/ws/abdera2/core/src/main/java/org/apache/abdera2/protocol/client/AbderaSession.java>:[296,8]
cannot find symbol
symbol  : class RequestOptions
location: class org.apache.abdera2.protocol.client.AbderaSession
[ERROR] <https://builds.apache.org/job/Abdera2-trunk/ws/abdera2/core/src/main/java/org/apache/abdera2/protocol/client/AbderaSession.java>:[300,25]
cannot find symbol
symbol  : class ClientResponse
location: class org.apache.abdera2.protocol.client.AbderaSession
[ERROR] <https://builds.apache.org/job/Abdera2-trunk/ws/abdera2/core/src/main/java/org/apache/abdera2/protocol/client/AbderaSession.java>:[300,64]
cannot find symbol
symbol  : class ClientResponse
location: class org.apache.abdera2.protocol.client.AbderaSession
[ERROR] <https://builds.apache.org/job/Abdera2-trunk/ws/abdera2/core/src/main/java/org/apache/abdera2/protocol/client/AbderaSession.java>:[300,89]
cannot find symbol
symbol  : class RequestOptions
location: class org.apache.abdera2.protocol.client.AbderaSession
[ERROR] <https://builds.apache.org/job/Abdera2-trunk/ws/abdera2/core/src/main/java/org/apache/abdera2/protocol/client/AbderaClient.java>:[43,22]
cannot find symbol
symbol  : class Client
location: class org.apache.abdera2.protocol.client.AbderaClient
[ERROR] <https://builds.apache.org/job/Abdera2-trunk/ws/abdera2/core/src/main/java/org/apache/abdera2/protocol/client/AbderaClient.java>:[58,4]
cannot find symbol
symbol  : class Client
location: class org.apache.abdera2.protocol.client.AbderaClient
[ERROR] <https://builds.apache.org/job/Abdera2-trunk/ws/abdera2/core/src/main/java/org/apache/abdera2/protocol/client/AbderaClient.java>:[64,6]
cannot find symbol
symbol  : class Client
location: class org.apache.abdera2.protocol.client.AbderaClient
[ERROR] <https://builds.apache.org/job/Abdera2-trunk/ws/abdera2/core/src/main/java/org/apache/abdera2/protocol/client/AbderaClient.java>:[108,4]
cannot find symbol
symbol  : class RequestOptions
location: class org.apache.abdera2.protocol.client.AbderaClient
[ERROR] <https://builds.apache.org/job/Abdera2-trunk/ws/abdera2/core/src/main/java/org/apache/abdera2/protocol/client/AbderaClient.java>:[118,4]
cannot find symbol
symbol  : class RequestOptions
location: class org.apache.abdera2.protocol.client.AbderaClient
[ERROR] <https://builds.apache.org/job/Abdera2-trunk/ws/abdera2/core/src/main/java/org/apache/abdera2/protocol/client/AbderaClient.java>:[136,20]
cannot find symbol
symbol  : class Session
location: class org.apache.abdera2.protocol.client.AbderaClient
[ERROR] <https://builds.apache.org/job/Abdera2-trunk/ws/abdera2/core/src/main/java/org/apache/abdera2/protocol/client/AbderaClientResponseImpl.java>:[32,10]
cannot find symbol
symbol: class ClientResponseWrapper
  extends ClientResponseWrapper implements AbderaClientResponse {
[ERROR] <https://builds.apache.org/job/Abdera2-trunk/ws/abdera2/core/src/main/java/org/apache/abdera2/protocol/client/AbderaClientResponseImpl.java>:[35,4]
cannot find symbol
symbol  : class ClientResponse
location: class org.apache.abdera2.protocol.client.AbderaClientResponseImpl
[ERROR] <https://builds.apache.org/job/Abdera2-trunk/ws/abdera2/core/src/main/java/org/apache/abdera2/protocol/client/AbderaSession.java>:[49,28]
cannot find symbol
symbol  : variable client
location: class org.apache.abdera2.protocol.client.AbderaSession
[ERROR] <https://builds.apache.org/job/Abdera2-trunk/ws/abdera2/core/src/main/java/org/apache/abdera2/protocol/client/AbderaSession.java>:[93,47]
cannot find symbol
symbol  : method getDefaultRequestOptions()
location: class org.apache.abdera2.protocol.client.AbderaSession
[ERROR] <https://builds.apache.org/job/Abdera2-trunk/ws/abdera2/core/src/main/java/org/apache/abdera2/protocol/client/AbderaSession.java>:[136,20]
cannot find symbol
symbol  : method getDefaultRequestOptions()
location: class org.apache.abdera2.protocol.client.AbderaSession
[ERROR] <https://builds.apache.org/job/Abdera2-trunk/ws/abdera2/core/src/main/java/org/apache/abdera2/protocol/client/AbderaSession.java>:[141,22]
package RequestOptions does not exist
[ERROR] <https://builds.apache.org/job/Abdera2-trunk/ws/abdera2/core/src/main/java/org/apache/abdera2/protocol/client/AbderaSession.java>:[163,22]
cannot find symbol
symbol  : method getDefaultRequestOptions()
location: class org.apache.abdera2.protocol.client.AbderaSession
[ERROR] <https://builds.apache.org/job/Abdera2-trunk/ws/abdera2/core/src/main/java/org/apache/abdera2/protocol/client/AbderaSession.java>:[169,26]
package RequestOptions does not exist
[ERROR] <https://builds.apache.org/job/Abdera2-trunk/ws/abdera2/core/src/main/java/org/apache/abdera2/protocol/client/AbderaSession.java>:[187,41]
cannot find symbol
symbol  : method getDefaultRequestOptions()
location: class org.apache.abdera2.protocol.client.AbderaSession
[ERROR] <https://builds.apache.org/job/Abdera2-trunk/ws/abdera2/core/src/main/java/org/apache/abdera2/protocol/client/AbderaSession.java>:[197,37]
cannot find symbol
symbol  : method getDefaultRequestOptions()
location: class org.apache.abdera2.protocol.client.AbderaSession
[ERROR] <https://builds.apache.org/job/Abdera2-trunk/ws/abdera2/core/src/main/java/org/apache/abdera2/protocol/client/AbderaSession.java>:[207,40]
cannot find symbol
symbol  : method getDefaultRequestOptions()
location: class org.apache.abdera2.protocol.client.AbderaSession
[ERROR] <https://builds.apache.org/job/Abdera2-trunk/ws/abdera2/core/src/main/java/org/apache/abdera2/protocol/client/AbderaSession.java>:[217,36]
cannot find symbol
symbol  : method getDefaultRequestOptions()
location: class org.apache.abdera2.protocol.client.AbderaSession
[ERROR] <https://builds.apache.org/job/Abdera2-trunk/ws/abdera2/core/src/main/java/org/apache/abdera2/protocol/client/AbderaSession.java>:[276,22]
cannot find symbol
symbol  : method getDefaultRequestOptions()
location: class org.apache.abdera2.protocol.client.AbderaSession
[ERROR] <https://builds.apache.org/job/Abdera2-trunk/ws/abdera2/core/src/main/java/org/apache/abdera2/protocol/client/AbderaClient.java>:[38,10]
cannot find symbol
symbol  : class BasicClient
location: class org.apache.abdera2.protocol.client.AbderaClient
[ERROR] <https://builds.apache.org/job/Abdera2-trunk/ws/abdera2/core/src/main/java/org/apache/abdera2/protocol/client/AbderaClient.java>:[40,6]
cannot find symbol
symbol  : variable DEFAULT_USER_AGENT
location: class org.apache.abdera2.protocol.client.AbderaClient
[ERROR] <https://builds.apache.org/job/Abdera2-trunk/ws/abdera2/core/src/main/java/org/apache/abdera2/protocol/client/AbderaClient.java>:[47,6]
cannot find symbol
symbol  : variable DEFAULT_USER_AGENT
location: class org.apache.abdera2.protocol.client.AbderaClient
[ERROR] <https://builds.apache.org/job/Abdera2-trunk/ws/abdera2/core/src/main/java/org/apache/abdera2/protocol/client/AbderaClient.java>:[52,10]
cannot find symbol
symbol  : class BasicClient
location: class org.apache.abdera2.protocol.client.AbderaClient
[ERROR] <https://builds.apache.org/job/Abdera2-trunk/ws/abdera2/core/src/main/java/org/apache/abdera2/protocol/client/AbderaClient.java>:[72,13]
cannot find symbol
symbol  : class BasicClient
location: class org.apache.abdera2.protocol.client.AbderaClient
[ERROR] <https://builds.apache.org/job/Abdera2-trunk/ws/abdera2/core/src/main/java/org/apache/abdera2/protocol/client/AbderaClient.java>:[72,56]
cannot find symbol
symbol  : variable DEFAULT_USER_AGENT
location: class org.apache.abdera2.protocol.client.AbderaClient
[ERROR] <https://builds.apache.org/job/Abdera2-trunk/ws/abdera2/core/src/main/java/org/apache/abdera2/protocol/client/AbderaClient.java>:[76,13]
cannot find symbol
symbol  : class BasicClient
location: class org.apache.abdera2.protocol.client.AbderaClient
[ERROR] <https://builds.apache.org/job/Abdera2-trunk/ws/abdera2/core/src/main/java/org/apache/abdera2/protocol/client/AbderaClient.java>:[76,42]
cannot find symbol
symbol  : variable DEFAULT_USER_AGENT
location: class org.apache.abdera2.protocol.client.AbderaClient
[ERROR] <https://builds.apache.org/job/Abdera2-trunk/ws/abdera2/core/src/main/java/org/apache/abdera2/protocol/client/AbderaClient.java>:[80,13]
cannot find symbol
symbol  : class BasicClient
location: class org.apache.abdera2.protocol.client.AbderaClient
[ERROR] <https://builds.apache.org/job/Abdera2-trunk/ws/abdera2/core/src/main/java/org/apache/abdera2/protocol/client/AbderaClient.java>:[80,36]
cannot find symbol
symbol  : variable DEFAULT_USER_AGENT
location: class org.apache.abdera2.protocol.client.AbderaClient
[ERROR] <https://builds.apache.org/job/Abdera2-trunk/ws/abdera2/core/src/main/java/org/apache/abdera2/protocol/client/AbderaClient.java>:[122,8]
cannot find symbol
symbol  : variable RequestHelper
location: class org.apache.abdera2.protocol.client.AbderaClient
[ERROR] <https://builds.apache.org/job/Abdera2-trunk/ws/abdera2/core/src/main/java/org/apache/abdera2/protocol/client/AbderaClient.java>:[128,27]
cannot find symbol
symbol  : method getClient()
location: class org.apache.abdera2.protocol.client.AbderaClient
[ERROR] <https://builds.apache.org/job/Abdera2-trunk/ws/abdera2/core/src/main/java/org/apache/abdera2/protocol/client/AbderaClient.java>:[135,2]
method does not override or implement a method from a supertype
[ERROR] <https://builds.apache.org/job/Abdera2-trunk/ws/abdera2/core/src/main/java/org/apache/abdera2/protocol/client/AbderaClientResponseImpl.java>:[40,31]
cannot find symbol
symbol  : method getSession()
location: class org.apache.abdera2.protocol.client.AbderaClientResponseImpl
[ERROR] <https://builds.apache.org/job/Abdera2-trunk/ws/abdera2/core/src/main/java/org/apache/abdera2/protocol/client/AbderaClientResponseImpl.java>:[63,23]
cannot find symbol
symbol  : method getCharacterEncoding()
location: class org.apache.abdera2.protocol.client.AbderaClientResponseImpl
[ERROR] <https://builds.apache.org/job/Abdera2-trunk/ws/abdera2/core/src/main/java/org/apache/abdera2/protocol/client/AbderaClientResponseImpl.java>:[66,15]
cannot find symbol
symbol  : method getContentLocation()
location: class org.apache.abdera2.protocol.client.AbderaClientResponseImpl
[ERROR] <https://builds.apache.org/job/Abdera2-trunk/ws/abdera2/core/src/main/java/org/apache/abdera2/protocol/client/AbderaClientResponseImpl.java>:[68,26]
cannot find symbol
symbol  : method getUri()
location: class org.apache.abdera2.protocol.client.AbderaClientResponseImpl
[ERROR] <https://builds.apache.org/job/Abdera2-trunk/ws/abdera2/core/src/main/java/org/apache/abdera2/protocol/client/AbderaClientResponseImpl.java>:[71,56]
cannot find symbol
symbol  : method getUri()
location: class org.apache.abdera2.protocol.client.AbderaClientResponseImpl
[ERROR] <https://builds.apache.org/job/Abdera2-trunk/ws/abdera2/core/src/main/java/org/apache/abdera2/protocol/client/AbderaClientResponseImpl.java>:[73,37]
cannot find symbol
symbol  : method getInputStream()
location: class org.apache.abdera2.protocol.client.AbderaClientResponseImpl
[ERROR] <https://builds.apache.org/job/Abdera2-trunk/ws/abdera2/core/src/main/java/org/apache/abdera2/protocol/client/AbderaClientResponseImpl.java>:[74,23]
cannot find symbol
symbol  : method getEntityTag()
location: class org.apache.abdera2.protocol.client.AbderaClientResponseImpl
[ERROR] <https://builds.apache.org/job/Abdera2-trunk/ws/abdera2/core/src/main/java/org/apache/abdera2/protocol/client/AbderaClientResponseImpl.java>:[77,20]
cannot find symbol
symbol  : method getLastModified()
location: class org.apache.abdera2.protocol.client.AbderaClientResponseImpl
[ERROR] <https://builds.apache.org/job/Abdera2-trunk/ws/abdera2/core/src/main/java/org/apache/abdera2/protocol/client/AbderaClientResponseImpl.java>:[80,20]
cannot find symbol
symbol  : method getContentType()
location: class org.apache.abdera2.protocol.client.AbderaClientResponseImpl
[ERROR] <https://builds.apache.org/job/Abdera2-trunk/ws/abdera2/core/src/main/java/org/apache/abdera2/protocol/client/AbderaClientResponseImpl.java>:[83,24]
cannot find symbol
symbol  : method getContentLanguage()
location: class org.apache.abdera2.protocol.client.AbderaClientResponseImpl
[ERROR] <https://builds.apache.org/job/Abdera2-trunk/ws/abdera2/core/src/main/java/org/apache/abdera2/protocol/client/AbderaClientResponseImpl.java>:[86,20]
cannot find symbol
symbol  : method getSlug()
location: class org.apache.abdera2.protocol.client.AbderaClientResponseImpl
[INFO] 76 errors 
[INFO] -------------------------------------------------------------
[JENKINS] Archiving <https://builds.apache.org/job/Abdera2-trunk/ws/abdera2/core/pom.xml>
to /home/hudson/hudson/jobs/Abdera2-trunk/modules/org.apache.abdera2$abdera2-core/builds/2011-12-02_00-01-08/archive/org.apache.abdera2/abdera2-core/2.0-SNAPSHOT/abdera2-core-2.0-SNAPSHOT.pom
[INFO] ------------------------------------------------------------------------
[INFO] Reactor Summary:
[INFO] 
[INFO] Apache Abdera2 .................................... SUCCESS [16.561s]
[INFO] Abdera2 Common Library ............................ SUCCESS [16.289s]
[INFO] Abdera2 Core ...................................... FAILURE [5.654s]
[INFO] Abdera2 Server .................................... SKIPPED
[INFO] Abdera2 Client .................................... SKIPPED
[INFO] Abdera2 Activities ................................ SKIPPED
[INFO] Abdera2 Extensions ................................ SKIPPED
[INFO] Abdera2 Security .................................. SKIPPED
[INFO] Abdera2 Tests ..................................... SKIPPED
[INFO] Abdera Examples ................................... SKIPPED
[INFO] ------------------------------------------------------------------------
[INFO] BUILD FAILURE
[INFO] ------------------------------------------------------------------------
[INFO] Total time: 42.227s
[INFO] Finished at: Fri Dec 02 00:02:00 UTC 2011
[INFO] Final Memory: 25M/724M
[INFO] ------------------------------------------------------------------------
Waiting for Jenkins to finish collecting data
mavenExecutionResult exceptions not empty
message : Failed to execute goal org.apache.maven.plugins:maven-compiler-plugin:2.3.2:compile
(default-compile) on project abdera2-core: Compilation failure
cause : Compilation failure
Stack trace : 
org.apache.maven.lifecycle.LifecycleExecutionException: Failed to execute goal org.apache.maven.plugins:maven-compiler-plugin:2.3.2:compile
(default-compile) on project abdera2-core: Compilation failure
	at org.apache.maven.lifecycle.internal.MojoExecutor.execute(MojoExecutor.java:213)
	at org.apache.maven.lifecycle.internal.MojoExecutor.execute(MojoExecutor.java:153)
	at org.apache.maven.lifecycle.internal.MojoExecutor.execute(MojoExecutor.java:145)
	at org.apache.maven.lifecycle.internal.LifecycleModuleBuilder.buildProject(LifecycleModuleBuilder.java:84)
	at org.apache.maven.lifecycle.internal.LifecycleModuleBuilder.buildProject(LifecycleModuleBuilder.java:59)
	at org.apache.maven.lifecycle.internal.LifecycleStarter.singleThreadedBuild(LifecycleStarter.java:183)
	at org.apache.maven.lifecycle.internal.LifecycleStarter.execute(LifecycleStarter.java:161)
	at org.apache.maven.DefaultMaven.doExecute(DefaultMaven.java:319)
	at org.apache.maven.DefaultMaven.execute(DefaultMaven.java:156)
	at org.jvnet.hudson.maven3.launcher.Maven3Launcher.main(Maven3Launcher.java:79)
	at sun.reflect.NativeMethodAccessorImpl.invoke0(Native Method)
	at sun.reflect.NativeMethodAccessorImpl.invoke(NativeMethodAccessorImpl.java:39)
	at sun.reflect.DelegatingMethodAccessorImpl.invoke(DelegatingMethodAccessorImpl.java:25)
	at java.lang.reflect.Method.invoke(Method.java:597)
	at org.codehaus.plexus.classworlds.launcher.Launcher.launchStandard(Launcher.java:329)
	at org.codehaus.plexus.classworlds.launcher.Launcher.launch(Launcher.java:239)
	at org.jvnet.hudson.maven3.agent.Maven3Main.launch(Maven3Main.java:158)
	at hudson.maven.Maven3Builder.call(Maven3Builder.java:122)
	at hudson.maven.Maven3Builder.call(Maven3Builder.java:74)
	at hudson.remoting.UserRequest.perform(UserRequest.java:118)
	at hudson.remoting.UserRequest.perform(UserRequest.java:48)
	at hudson.remoting.Request$2.run(Request.java:287)
	at java.util.concurrent.Executors$RunnableAdapter.call(Executors.java:441)
	at java.util.concurrent.FutureTask$Sync.innerRun(FutureTask.java:303)
	at java.util.concurrent.FutureTask.run(FutureTask.java:138)
	at java.util.concurrent.ThreadPoolExecutor$Worker.runTask(ThreadPoolExecutor.java:886)
	at java.util.concurrent.ThreadPoolExecutor$Worker.run(ThreadPoolExecutor.java:908)
	at java.lang.Thread.run(Thread.java:662)
Caused by: org.apache.maven.plugin.CompilationFailureException: Compilation failure
	at org.apache.maven.plugin.AbstractCompilerMojo.execute(AbstractCompilerMojo.java:656)
	at org.apache.maven.plugin.CompilerMojo.execute(CompilerMojo.java:128)
	at org.apache.maven.plugin.DefaultBuildPluginManager.executeMojo(DefaultBuildPluginManager.java:101)
	at org.apache.maven.lifecycle.internal.MojoExecutor.execute(MojoExecutor.java:209)
	... 27 more
Sending e-mails to: dev@abdera.apache.org
Sending e-mails to: dev@abdera.apache.org
channel stopped


Mime
View raw message