abdera-dev mailing list archives

Site index · List index
Message view « Date » · « Thread »
Top « Date » · « Thread »
From Apache Jenkins Server <jenk...@builds.apache.org>
Subject Build failed in Jenkins: Abdera-trunk #583
Date Mon, 05 Dec 2011 00:07:47 GMT
See <https://builds.apache.org/job/Abdera-trunk/583/changes>

Changes:

[veithen] Only add default namespace declarations on "service" elements that are created programmatically,
but not on elments that are created by the parser. Otherwise this may result in inconsistent
namespaces. This change also makes Abdera 1.x compatible with Axiom 1.2.13 (which detects
this situation and triggers an exception).

[veithen] ABDERA-284: Updated the Axiom version in the ant build (to match the one used in
the Maven build).

------------------------------------------
[...truncated 4749 lines...]
[JENKINS] Archiving <https://builds.apache.org/job/Abdera-trunk/ws/trunk/extensions/rss/target/abdera-extensions-rss-1.2-SNAPSHOT-sources.jar>
to /home/hudson/hudson/jobs/Abdera-trunk/modules/org.apache.abdera$abdera-extensions-rss/builds/2011-12-05_00-01-53/archive/org.apache.abdera/abdera-extensions-rss/1.2-SNAPSHOT/abdera-extensions-rss-1.2-SNAPSHOT-sources.jar
[INFO]                                                                         
[INFO] ------------------------------------------------------------------------
[INFO] Building Abdera Extensions - Features 1.2-SNAPSHOT
[INFO] ------------------------------------------------------------------------
[INFO] 
[INFO] --- maven-clean-plugin:2.4.1:clean (default-clean) @ abdera-extensions-features ---
[INFO] 
[INFO] --- cobertura-maven-plugin:2.4:clean (default) @ abdera-extensions-features ---
[INFO] 
[INFO] --- maven-bundle-plugin:2.1.0:cleanVersions (default) @ abdera-extensions-features
---
[INFO] 
[INFO] --- maven-remote-resources-plugin:1.0:process (compile) @ abdera-extensions-features
---
[INFO] Using 'UTF-8' encoding to copy filtered resources.
[INFO] [INFO] Copying 1 resource
[INFO] Copying 2 resources

[INFO] --- maven-resources-plugin:2.4.3:resources (default-resources) @ abdera-extensions-features
---
[INFO] [INFO] Compiling 9 source files to <https://builds.apache.org/job/Abdera-trunk/ws/trunk/extensions/features/target/classes>

[INFO] --- maven-compiler-plugin:2.3.2:compile (default-compile) @ abdera-extensions-features
---
[INFO] [INFO] Using 'UTF-8' encoding to copy filtered resources.
[INFO] Copying 0 resource
[INFO] Copying 2 resources

[INFO] --- maven-resources-plugin:2.4.3:testResources (default-testResources) @ abdera-extensions-features
---
[INFO] [INFO] Compiling 2 source files to <https://builds.apache.org/job/Abdera-trunk/ws/trunk/extensions/features/target/test-classes>

[INFO] --- maven-compiler-plugin:2.3.2:testCompile (default-testCompile) @ abdera-extensions-features
---
[INFO] [INFO] Surefire report directory: <https://builds.apache.org/job/Abdera-trunk/ws/trunk/extensions/features/target/surefire-reports>

[INFO] --- maven-surefire-plugin:2.6:test (default-test) @ abdera-extensions-features ---

-------------------------------------------------------
 T E S T S
-------------------------------------------------------
Running org.apache.abdera.test.ext.features.FeatureTest
Tests run: 4, Failures: 0, Errors: 0, Skipped: 0, Time elapsed: 0.372 sec

Results :

Tests run: 4, Failures: 0, Errors: 0, Skipped: 0

[JENKINS] Recording test results
[INFO] [INFO] Building jar: <https://builds.apache.org/job/Abdera-trunk/ws/trunk/extensions/features/target/abdera-extensions-features-1.2-SNAPSHOT.jar>

[INFO] --- maven-jar-plugin:2.2:jar (default-jar) @ abdera-extensions-features ---
[INFO] 
[INFO] --- maven-bundle-plugin:2.1.0:cleanVersions (default) @ abdera-extensions-features
---
[JENKINS] Archiving <https://builds.apache.org/job/Abdera-trunk/ws/trunk/extensions/features/pom.xml>
to /home/hudson/hudson/jobs/Abdera-trunk/modules/org.apache.abdera$abdera-extensions-features/builds/2011-12-05_00-01-53/archive/org.apache.abdera/abdera-extensions-features/1.2-SNAPSHOT/abdera-extensions-features-1.2-SNAPSHOT.pom
[JENKINS] Archiving <https://builds.apache.org/job/Abdera-trunk/ws/trunk/extensions/features/target/abdera-extensions-features-1.2-SNAPSHOT.jar>
to /home/hudson/hudson/jobs/Abdera-trunk/modules/org.apache.abdera$abdera-extensions-features/builds/2011-12-05_00-01-53/archive/org.apache.abdera/abdera-extensions-features/1.2-SNAPSHOT/abdera-extensions-features-1.2-SNAPSHOT.jar
ignoring exception during new ExecutedMojo null
[INFO] 
[INFO] --- maven-source-plugin:2.1.2:jar (attach-sources) @ abdera-extensions-features ---
[INFO] META-INF already added, skipping
[INFO] META-INF already added, skipping
[INFO] META-INF/NOTICE already added, skipping
[INFO] META-INF/LICENSE already added, skipping
[INFO] Building jar: <https://builds.apache.org/job/Abdera-trunk/ws/trunk/extensions/features/target/abdera-extensions-features-1.2-SNAPSHOT-sources.jar>
[INFO] META-INF already added, skipping
[INFO] META-INF already added, skipping
[INFO] META-INF/NOTICE already added, skipping
[INFO] META-INF/LICENSE already added, skipping
[INFO] [INFO] Installing <https://builds.apache.org/job/Abdera-trunk/ws/trunk/extensions/features/target/abdera-extensions-features-1.2-SNAPSHOT.jar>
to /home/jenkins/.m2/repository/org/apache/abdera/abdera-extensions-features/1.2-SNAPSHOT/abdera-extensions-features-1.2-SNAPSHOT.jar

[INFO] Installing <https://builds.apache.org/job/Abdera-trunk/ws/trunk/extensions/features/pom.xml>
to /home/jenkins/.m2/repository/org/apache/abdera/abdera-extensions-features/1.2-SNAPSHOT/abdera-extensions-features-1.2-SNAPSHOT.pom
[INFO] Installing <https://builds.apache.org/job/Abdera-trunk/ws/trunk/extensions/features/target/abdera-extensions-features-1.2-SNAPSHOT-sources.jar>
to /home/jenkins/.m2/repository/org/apache/abdera/abdera-extensions-features/1.2-SNAPSHOT/abdera-extensions-features-1.2-SNAPSHOT-sources.jar
[INFO] --- maven-install-plugin:2.3.1:install (default-install) @ abdera-extensions-features
---
[JENKINS] Archiving <https://builds.apache.org/job/Abdera-trunk/ws/trunk/extensions/features/target/abdera-extensions-features-1.2-SNAPSHOT-sources.jar>
to /home/hudson/hudson/jobs/Abdera-trunk/modules/org.apache.abdera$abdera-extensions-features/builds/2011-12-05_00-01-53/archive/org.apache.abdera/abdera-extensions-features/1.2-SNAPSHOT/abdera-extensions-features-1.2-SNAPSHOT-sources.jar
[INFO]                                                                         
[INFO] ------------------------------------------------------------------------
[INFO] Building Abdera Extensions 1.2-SNAPSHOT
[INFO] ------------------------------------------------------------------------
[INFO] 
[INFO] --- maven-clean-plugin:2.4.1:clean (default-clean) @ abdera-extensions-parent ---
[INFO] 
[INFO] --- cobertura-maven-plugin:2.4:clean (default) @ abdera-extensions-parent ---
[INFO] 
[INFO] --- maven-bundle-plugin:2.1.0:cleanVersions (default) @ abdera-extensions-parent ---
[INFO] 
[INFO] --- maven-remote-resources-plugin:1.0:process (compile) @ abdera-extensions-parent
---
[INFO] 
[INFO] --- maven-bundle-plugin:2.1.0:cleanVersions (default) @ abdera-extensions-parent ---
[JENKINS] Archiving <https://builds.apache.org/job/Abdera-trunk/ws/trunk/extensions/pom.xml>
to /home/hudson/hudson/jobs/Abdera-trunk/modules/org.apache.abdera$abdera-extensions-parent/builds/2011-12-05_00-01-53/archive/org.apache.abdera/abdera-extensions-parent/1.2-SNAPSHOT/abdera-extensions-parent-1.2-SNAPSHOT.pom
ignoring exception during new ExecutedMojo null
[INFO] 
[INFO] --- maven-source-plugin:2.1.2:jar (attach-sources) @ abdera-extensions-parent ---
[INFO] [INFO] Installing <https://builds.apache.org/job/Abdera-trunk/ws/trunk/extensions/pom.xml>
to /home/jenkins/.m2/repository/org/apache/abdera/abdera-extensions-parent/1.2-SNAPSHOT/abdera-extensions-parent-1.2-SNAPSHOT.pom

[INFO] --- maven-install-plugin:2.3.1:install (default-install) @ abdera-extensions-parent
---
[INFO]                                                                         
[INFO] ------------------------------------------------------------------------
[INFO] Building Abdera Examples 1.2-SNAPSHOT
[INFO] ------------------------------------------------------------------------
[INFO] 
[INFO] --- maven-clean-plugin:2.4.1:clean (default-clean) @ abdera-examples ---
[INFO] 
[INFO] --- cobertura-maven-plugin:2.4:clean (default) @ abdera-examples ---
[INFO] 
[INFO] --- maven-bundle-plugin:2.1.0:cleanVersions (default) @ abdera-examples ---
[INFO] 
[INFO] --- maven-remote-resources-plugin:1.0:process (compile) @ abdera-examples ---
[INFO] Using 'UTF-8' encoding to copy filtered resources.
[INFO] [INFO] Copying 10 resources
[INFO] Copying 2 resources

[INFO] --- maven-resources-plugin:2.4.3:resources (default-resources) @ abdera-examples ---
[INFO] [INFO] Compiling 44 source files to <https://builds.apache.org/job/Abdera-trunk/ws/trunk/examples/target/classes>

[INFO] --- maven-compiler-plugin:2.3.2:compile (default-compile) @ abdera-examples ---
[INFO] [INFO] Using 'UTF-8' encoding to copy filtered resources.
[INFO] skip non existing resourceDirectory <https://builds.apache.org/job/Abdera-trunk/ws/trunk/examples/src/test/resources>
[INFO] Copying 2 resources

[INFO] --- maven-resources-plugin:2.4.3:testResources (default-testResources) @ abdera-examples
---
[INFO] [INFO] No sources to compile

[INFO] --- maven-compiler-plugin:2.3.2:testCompile (default-testCompile) @ abdera-examples
---
[INFO] [INFO] Surefire report directory: <https://builds.apache.org/job/Abdera-trunk/ws/trunk/examples/target/surefire-reports>

[INFO] --- maven-surefire-plugin:2.6:test (default-test) @ abdera-examples ---

-------------------------------------------------------
 T E S T S
-------------------------------------------------------
There are no tests to run.

Results :

Tests run: 0, Failures: 0, Errors: 0, Skipped: 0

[JENKINS] Recording test results
[INFO] [INFO] Building jar: <https://builds.apache.org/job/Abdera-trunk/ws/trunk/examples/target/abdera-examples-1.2-SNAPSHOT.jar>

[INFO] --- maven-jar-plugin:2.2:jar (default-jar) @ abdera-examples ---
[INFO] 
[INFO] --- maven-bundle-plugin:2.1.0:cleanVersions (default) @ abdera-examples ---
[JENKINS] Archiving <https://builds.apache.org/job/Abdera-trunk/ws/trunk/examples/pom.xml>
to /home/hudson/hudson/jobs/Abdera-trunk/modules/org.apache.abdera$abdera-examples/builds/2011-12-05_00-01-53/archive/org.apache.abdera/abdera-examples/1.2-SNAPSHOT/abdera-examples-1.2-SNAPSHOT.pom
[JENKINS] Archiving <https://builds.apache.org/job/Abdera-trunk/ws/trunk/examples/target/abdera-examples-1.2-SNAPSHOT.jar>
to /home/hudson/hudson/jobs/Abdera-trunk/modules/org.apache.abdera$abdera-examples/builds/2011-12-05_00-01-53/archive/org.apache.abdera/abdera-examples/1.2-SNAPSHOT/abdera-examples-1.2-SNAPSHOT.jar
ignoring exception during new ExecutedMojo null
[INFO] 
[INFO] --- maven-source-plugin:2.1.2:jar (attach-sources) @ abdera-examples ---
[INFO] org already added, skipping
[INFO] org/apache already added, skipping
[INFO] org/apache/abdera already added, skipping
[INFO] org/apache/abdera/examples already added, skipping
[INFO] org/apache/abdera/examples/appserver already added, skipping
[INFO] META-INF already added, skipping
[INFO] META-INF already added, skipping
[INFO] META-INF/NOTICE already added, skipping
[INFO] META-INF/LICENSE already added, skipping
[INFO] Building jar: <https://builds.apache.org/job/Abdera-trunk/ws/trunk/examples/target/abdera-examples-1.2-SNAPSHOT-sources.jar>
[INFO] org already added, skipping
[INFO] org/apache already added, skipping
[INFO] org/apache/abdera already added, skipping
[INFO] org/apache/abdera/examples already added, skipping
[INFO] org/apache/abdera/examples/appserver already added, skipping
[INFO] META-INF already added, skipping
[INFO] META-INF already added, skipping
[INFO] META-INF/NOTICE already added, skipping
[INFO] META-INF/LICENSE already added, skipping
[INFO] [INFO] Installing <https://builds.apache.org/job/Abdera-trunk/ws/trunk/examples/target/abdera-examples-1.2-SNAPSHOT.jar>
to /home/jenkins/.m2/repository/org/apache/abdera/abdera-examples/1.2-SNAPSHOT/abdera-examples-1.2-SNAPSHOT.jar

[INFO] Installing <https://builds.apache.org/job/Abdera-trunk/ws/trunk/examples/pom.xml>
to /home/jenkins/.m2/repository/org/apache/abdera/abdera-examples/1.2-SNAPSHOT/abdera-examples-1.2-SNAPSHOT.pom
[INFO] Installing <https://builds.apache.org/job/Abdera-trunk/ws/trunk/examples/target/abdera-examples-1.2-SNAPSHOT-sources.jar>
to /home/jenkins/.m2/repository/org/apache/abdera/abdera-examples/1.2-SNAPSHOT/abdera-examples-1.2-SNAPSHOT-sources.jar
[INFO] --- maven-install-plugin:2.3.1:install (default-install) @ abdera-examples ---
[JENKINS] Archiving <https://builds.apache.org/job/Abdera-trunk/ws/trunk/examples/target/abdera-examples-1.2-SNAPSHOT-sources.jar>
to /home/hudson/hudson/jobs/Abdera-trunk/modules/org.apache.abdera$abdera-examples/builds/2011-12-05_00-01-53/archive/org.apache.abdera/abdera-examples/1.2-SNAPSHOT/abdera-examples-1.2-SNAPSHOT-sources.jar
[INFO] ------------------------------------------------------------------------
[INFO] Reactor Summary:
[INFO] 
[INFO] Apache Abdera ..................................... SUCCESS [13.216s]
[INFO] I18N Libraries .................................... SUCCESS [46.588s]
[INFO] Abdera Core ....................................... SUCCESS [10.671s]
[INFO] Abdera Parser ..................................... SUCCESS [18.099s]
[INFO] Abdera Client ..................................... SUCCESS [9.705s]
[INFO] Abdera Server ..................................... SUCCESS [11.941s]
[INFO] Abdera Spring Integration ......................... SUCCESS [8.378s]
[INFO] Abdera Adapters ................................... SUCCESS [1.978s]
[INFO] Abdera JCR Adapter ................................ SUCCESS [13.061s]
[INFO] Abdera Filesystem Adapter ......................... SUCCESS [7.879s]
[INFO] Abdera JDBC Adapter ............................... SUCCESS [7.030s]
[INFO] Abdera Security ................................... SUCCESS [9.876s]
[INFO] Abdera Extensions - GData ......................... SUCCESS [12.424s]
[INFO] Abdera Extensions - Geo ........................... SUCCESS [7.246s]
[INFO] Abdera Extensions - HTML .......................... SUCCESS [7.100s]
[INFO] Abdera Extensions - Main .......................... SUCCESS [8.089s]
[INFO] Abdera Extensions - JSON .......................... SUCCESS [7.960s]
[INFO] Abdera Extensions - Media ......................... SUCCESS [8.508s]
[INFO] Abdera Extensions - OAuth ......................... SUCCESS [9.524s]
[INFO] Abdera Extensions - OpenSearch .................... SUCCESS [10.342s]
[INFO] Abdera Extensions - Serializer .................... SUCCESS [9.168s]
[INFO] Abdera Extensions - Sharing ....................... SUCCESS [8.091s]
[INFO] Abdera Extensions - WSSE .......................... SUCCESS [6.978s]
[INFO] Abdera Bundle Jar ................................. SUCCESS [19.032s]
[INFO] Abdera Extensions - RSS ........................... SUCCESS [9.015s]
[INFO] Abdera Extensions - Features ...................... SUCCESS [5.746s]
[INFO] Abdera Extensions ................................. SUCCESS [3.706s]
[INFO] Abdera Examples ................................... SUCCESS [5.909s]
[INFO] ------------------------------------------------------------------------
[INFO] BUILD SUCCESS
[INFO] ------------------------------------------------------------------------
[INFO] Total time: 5:40.996s
[INFO] Finished at: Mon Dec 05 00:07:45 UTC 2011
[INFO] Final Memory: 72M/745M
[INFO] ------------------------------------------------------------------------
channel stopped
Maven RedeployPublished use remote ubuntu4 maven settings from : /home/jenkins/.m2/settings.xml
[ERROR] uniqueVersion == false is not anymore supported in maven 3
[INFO] Deployment in https://repository.apache.org/content/repositories/snapshots (id=,uniqueVersion=false)
Deploying the main artifact abdera-1.2-SNAPSHOT.pom
Downloading: https://repository.apache.org/content/repositories/snapshots/org/apache/abdera/abdera/1.2-SNAPSHOT/maven-metadata.xml
Downloaded: https://repository.apache.org/content/repositories/snapshots/org/apache/abdera/abdera/1.2-SNAPSHOT/maven-metadata.xml
(598 B at 2.5 KB/sec)
Uploading: https://repository.apache.org/content/repositories/snapshots/org/apache/abdera/abdera/1.2-SNAPSHOT/abdera-1.2-20111205.000747-66.pom
Uploading: https://repository.apache.org/content/repositories/snapshots/org/apache/abdera/abdera/1.2-SNAPSHOT/abdera-1.2-20111205.000747-66.pom
ERROR: Failed to deploy artifacts: Could not transfer artifact org.apache.abdera:abdera:pom:1.2-20111205.000747-66
from/to  (https://repository.apache.org/content/repositories/snapshots): Failed to transfer
file: https://repository.apache.org/content/repositories/snapshots/org/apache/abdera/abdera/1.2-SNAPSHOT/abdera-1.2-20111205.000747-66.pom.
Return code is: 401
org.apache.maven.artifact.deployer.ArtifactDeploymentException: Failed to deploy artifacts:
Could not transfer artifact org.apache.abdera:abdera:pom:1.2-20111205.000747-66 from/to  (https://repository.apache.org/content/repositories/snapshots):
Failed to transfer file: https://repository.apache.org/content/repositories/snapshots/org/apache/abdera/abdera/1.2-SNAPSHOT/abdera-1.2-20111205.000747-66.pom.
Return code is: 401
	at org.apache.maven.artifact.deployer.DefaultArtifactDeployer.deploy(DefaultArtifactDeployer.java:141)
	at hudson.maven.reporters.MavenArtifactRecord.deploy(MavenArtifactRecord.java:189)
	at hudson.maven.RedeployPublisher.perform(RedeployPublisher.java:158)
	at hudson.tasks.BuildStepMonitor$1.perform(BuildStepMonitor.java:19)
	at hudson.model.AbstractBuild$AbstractRunner.perform(AbstractBuild.java:693)
	at hudson.model.AbstractBuild$AbstractRunner.performAllBuildSteps(AbstractBuild.java:668)
	at hudson.maven.MavenModuleSetBuild$RunnerImpl.post2(MavenModuleSetBuild.java:953)
	at hudson.model.AbstractBuild$AbstractRunner.post(AbstractBuild.java:615)
	at hudson.model.Run.run(Run.java:1401)
	at hudson.maven.MavenModuleSetBuild.run(MavenModuleSetBuild.java:474)
	at hudson.model.ResourceController.execute(ResourceController.java:88)
	at hudson.model.Executor.run(Executor.java:230)
Caused by: org.sonatype.aether.deployment.DeploymentException: Failed to deploy artifacts:
Could not transfer artifact org.apache.abdera:abdera:pom:1.2-20111205.000747-66 from/to  (https://repository.apache.org/content/repositories/snapshots):
Failed to transfer file: https://repository.apache.org/content/repositories/snapshots/org/apache/abdera/abdera/1.2-SNAPSHOT/abdera-1.2-20111205.000747-66.pom.
Return code is: 401
	at org.sonatype.aether.impl.internal.DefaultDeployer.deploy(DefaultDeployer.java:284)
	at org.sonatype.aether.impl.internal.DefaultDeployer.deploy(DefaultDeployer.java:215)
	at org.sonatype.aether.impl.internal.DefaultRepositorySystem.deploy(DefaultRepositorySystem.java:480)
	at org.apache.maven.artifact.deployer.DefaultArtifactDeployer.deploy(DefaultArtifactDeployer.java:137)
	... 11 more
Caused by: org.sonatype.aether.transfer.ArtifactTransferException: Could not transfer artifact
org.apache.abdera:abdera:pom:1.2-20111205.000747-66 from/to  (https://repository.apache.org/content/repositories/snapshots):
Failed to transfer file: https://repository.apache.org/content/repositories/snapshots/org/apache/abdera/abdera/1.2-SNAPSHOT/abdera-1.2-20111205.000747-66.pom.
Return code is: 401
	at org.sonatype.aether.connector.wagon.WagonRepositoryConnector$4.wrap(WagonRepositoryConnector.java:949)
	at org.sonatype.aether.connector.wagon.WagonRepositoryConnector$4.wrap(WagonRepositoryConnector.java:940)
	at org.sonatype.aether.connector.wagon.WagonRepositoryConnector$PutTask.flush(WagonRepositoryConnector.java:864)
	at org.sonatype.aether.connector.wagon.WagonRepositoryConnector.put(WagonRepositoryConnector.java:466)
	at org.sonatype.aether.impl.internal.DefaultDeployer.deploy(DefaultDeployer.java:278)
	... 14 more
Caused by: org.apache.maven.wagon.TransferFailedException: Failed to transfer file: https://repository.apache.org/content/repositories/snapshots/org/apache/abdera/abdera/1.2-SNAPSHOT/abdera-1.2-20111205.000747-66.pom.
Return code is: 401
	at org.apache.maven.wagon.shared.http.AbstractHttpClientWagon.put(AbstractHttpClientWagon.java:368)
	at org.apache.maven.wagon.shared.http.AbstractHttpClientWagon.put(AbstractHttpClientWagon.java:280)
	at org.sonatype.aether.connector.wagon.WagonRepositoryConnector$PutTask.run(WagonRepositoryConnector.java:825)
	at org.sonatype.aether.connector.wagon.WagonRepositoryConnector.put(WagonRepositoryConnector.java:465)
	... 15 more
[INFO] Deployment failed after 0.82 sec
Build step 'Deploy artifacts to Maven repository' changed build result to FAILURE


Mime
View raw message