abdera-dev mailing list archives

Site index · List index
Message view « Date » · « Thread »
Top « Date » · « Thread »
From Apache Jenkins Server <jenk...@builds.apache.org>
Subject Build failed in Jenkins: Abdera2-trunk #110
Date Sun, 01 Jan 2012 00:01:22 GMT
See <https://builds.apache.org/job/Abdera2-trunk/110/changes>

Changes:

[jmsnell] Immutable/Threadsafe treatment for WriterOptions too

[jmsnell] Noticed that everywhere the ParserOptions was actually being used, we were making
defensive copies of it anyway to ward off the evil spirits of mutability... this goes ahead
and makes ParserOptions immutable and threadsafe just like all the other similar things throughout
Abdera2.

------------------------------------------
Started by timer
Building remotely on ubuntu3
Updating https://svn.apache.org/repos/asf/abdera/abdera2
U         test/src/main/java/org/apache/abdera2/test/parser/EncodingTest.java
U         test/src/main/java/org/apache/abdera2/test/parser/ParserTest.java
U         test/src/main/java/org/apache/abdera2/test/parser/axiom/FOMTest.java
U         test/src/main/java/org/apache/abdera2/test/util/AbstractParserOptionsTest.java
U         test/src/main/java/org/apache/abdera2/test/client/AppTest.java
U         ext/src/main/java/org/apache/abdera2/ext/activities/ActivityToFeedParser.java
U         ext/src/main/java/org/apache/abdera2/ext/activities/FeedToActivityWriter.java
D         ext/src/main/java/org/apache/abdera2/ext/html/HtmlParserOptions.java
U         ext/src/main/java/org/apache/abdera2/ext/html/HtmlParser.java
U         ext/src/main/java/org/apache/abdera2/ext/json/JSONWriter.java
U         common/src/main/java/org/apache/abdera2/common/io/Compression.java
U         core/src/main/java/org/apache/abdera2/model/Base.java
U         core/src/main/java/org/apache/abdera2/model/ElementWrapper.java
U         core/src/main/java/org/apache/abdera2/protocol/client/AbderaClientResponseImpl.java
D         core/src/main/java/org/apache/abdera2/parser/AbstractParserOptions.java
U         core/src/main/java/org/apache/abdera2/parser/AbstractParser.java
U         core/src/main/java/org/apache/abdera2/parser/ParserOptions.java
U         core/src/main/java/org/apache/abdera2/parser/Parser.java
D         core/src/main/java/org/apache/abdera2/parser/axiom/FOMParserOptions.java
D         core/src/main/java/org/apache/abdera2/parser/axiom/FOMWriterOptions.java
U         core/src/main/java/org/apache/abdera2/parser/axiom/FOMWriter.java
U         core/src/main/java/org/apache/abdera2/parser/axiom/FOMDocument.java
U         core/src/main/java/org/apache/abdera2/parser/axiom/PrettyWriter.java
U         core/src/main/java/org/apache/abdera2/parser/axiom/FOMBuilder.java
U         core/src/main/java/org/apache/abdera2/parser/axiom/FOMElement.java
U         core/src/main/java/org/apache/abdera2/parser/axiom/FOMParser.java
D         core/src/main/java/org/apache/abdera2/writer/AbstractWriterOptions.java
U         core/src/main/java/org/apache/abdera2/writer/AbstractWriter.java
U         core/src/main/java/org/apache/abdera2/writer/WriterOptions.java
U         examples/src/main/java/org/apache/abdera2/examples/activities/FeedToStreamConversionExample.java
U         examples/src/main/java/org/apache/abdera2/examples/activities/MapRedExample.java
U         examples/src/main/java/org/apache/abdera2/examples/simple/UnacceptableElementsExample.java
U         examples/src/main/java/org/apache/abdera2/examples/simple/PrintTitles.java
At revision 1226201
Parsing POMs
[abdera2] $ /home/hudson/tools/java/latest1.6/bin/java -Xmx756m -Xms756m -XX:MaxPermSize=512m
-cp /home/jenkins/jenkins-slave/maven3-agent.jar:/home/hudson/tools/maven/latest3/boot/plexus-classworlds-2.4.jar
org.jvnet.hudson.maven3.agent.Maven3Main /home/hudson/tools/maven/latest3 /x1/jenkins/jenkins-slave/slave.jar
/home/jenkins/jenkins-slave/maven3-interceptor.jar 37725
<===[JENKINS REMOTING CAPACITY]===>   channel started
Executing Maven:  -B -f <https://builds.apache.org/job/Abdera2-trunk/ws/abdera2/pom.xml>
clean install -U
[INFO] Scanning for projects...
[WARNING] 
[WARNING] Some problems were encountered while building the effective model for org.apache.abdera2:abdera2-common:bundle:2.0-SNAPSHOT
[WARNING] 'dependencies.dependency.scope' for junit:junit:jar must be one of [provided, compile,
runtime, test, system] but is 'test, compile, package'. @ org.apache.abdera2:abdera2:2.0-SNAPSHOT,
<https://builds.apache.org/job/Abdera2-trunk/ws/abdera2/pom.xml,> line 623, column 16
[WARNING] 
[WARNING] Some problems were encountered while building the effective model for org.apache.abdera2:abdera2-core:bundle:2.0-SNAPSHOT
[WARNING] 'dependencies.dependency.scope' for junit:junit:jar must be one of [provided, compile,
runtime, test, system] but is 'test, compile, package'. @ org.apache.abdera2:abdera2:2.0-SNAPSHOT,
<https://builds.apache.org/job/Abdera2-trunk/ws/abdera2/pom.xml,> line 623, column 16
[WARNING] 
[WARNING] Some problems were encountered while building the effective model for org.apache.abdera2:abdera2-server:bundle:2.0-SNAPSHOT
[WARNING] 'dependencies.dependency.scope' for junit:junit:jar must be one of [provided, compile,
runtime, test, system] but is 'test, compile, package'. @ org.apache.abdera2:abdera2:2.0-SNAPSHOT,
<https://builds.apache.org/job/Abdera2-trunk/ws/abdera2/pom.xml,> line 623, column 16
[WARNING] 
[WARNING] Some problems were encountered while building the effective model for org.apache.abdera2:abdera2-activities:bundle:2.0-SNAPSHOT
[WARNING] 'dependencies.dependency.scope' for junit:junit:jar must be one of [provided, compile,
runtime, test, system] but is 'test, compile, package'. @ org.apache.abdera2:abdera2:2.0-SNAPSHOT,
<https://builds.apache.org/job/Abdera2-trunk/ws/abdera2/pom.xml,> line 623, column 16
[WARNING] 
[WARNING] Some problems were encountered while building the effective model for org.apache.abdera2:abdera2-client:bundle:2.0-SNAPSHOT
[WARNING] 'dependencies.dependency.scope' for junit:junit:jar must be one of [provided, compile,
runtime, test, system] but is 'test, compile, package'. @ org.apache.abdera2:abdera2:2.0-SNAPSHOT,
<https://builds.apache.org/job/Abdera2-trunk/ws/abdera2/pom.xml,> line 623, column 16
[WARNING] 
[WARNING] Some problems were encountered while building the effective model for org.apache.abdera2:abdera2-ext:bundle:2.0-SNAPSHOT
[WARNING] 'dependencies.dependency.scope' for junit:junit:jar must be one of [provided, compile,
runtime, test, system] but is 'test, compile, package'. @ org.apache.abdera2:abdera2:2.0-SNAPSHOT,
<https://builds.apache.org/job/Abdera2-trunk/ws/abdera2/pom.xml,> line 623, column 16
[WARNING] 
[WARNING] Some problems were encountered while building the effective model for org.apache.abdera2:abdera2-security:bundle:2.0-SNAPSHOT
[WARNING] 'dependencies.dependency.scope' for junit:junit:jar must be one of [provided, compile,
runtime, test, system] but is 'test, compile, package'. @ org.apache.abdera2:abdera2:2.0-SNAPSHOT,
<https://builds.apache.org/job/Abdera2-trunk/ws/abdera2/pom.xml,> line 623, column 16
[WARNING] 
[WARNING] Some problems were encountered while building the effective model for org.apache.abdera2:abdera-examples:jar:2.0-SNAPSHOT
[WARNING] 'dependencies.dependency.scope' for junit:junit:jar must be one of [provided, compile,
runtime, test, system] but is 'test, compile, package'. @ org.apache.abdera2:abdera2:2.0-SNAPSHOT,
<https://builds.apache.org/job/Abdera2-trunk/ws/abdera2/pom.xml,> line 458, column 16
[WARNING] 
[WARNING] Some problems were encountered while building the effective model for org.apache.abdera2:abdera2:pom:2.0-SNAPSHOT
[WARNING] 'dependencies.dependency.scope' for junit:junit:jar must be one of [provided, compile,
runtime, test, system] but is 'test, compile, package'. @ line 623, column 16
[WARNING] 
[WARNING] It is highly recommended to fix these problems because they threaten the stability
of your build.
[WARNING] 
[WARNING] For this reason, future Maven versions might no longer support building such malformed
projects.
[WARNING] 
[INFO] ------------------------------------------------------------------------
[INFO] Reactor Build Order:
[INFO] 
[INFO] Apache Abdera2
[INFO] Abdera2 Common Library
[INFO] Abdera2 Client
[INFO] Abdera2 Core
[INFO] Abdera2 Server
[INFO] Abdera2 Activities
[INFO] Abdera2 Extensions
[INFO] Abdera2 Security
[INFO] Abdera2 Tests
[INFO] Abdera Examples
[INFO]                                                                         
[INFO] ------------------------------------------------------------------------
[INFO] Building Apache Abdera2 2.0-SNAPSHOT
[INFO] ------------------------------------------------------------------------
[WARNING] The artifact xml-apis:xml-apis:jar:2.0.2 has been relocated to xml-apis:xml-apis:jar:1.0.b2
[INFO] 
[INFO] --- maven-clean-plugin:2.4.1:clean (default-clean) @ abdera2 ---
[INFO] Deleting <https://builds.apache.org/job/Abdera2-trunk/ws/abdera2/target>
log4j:WARN No appenders could be found for logger (org.apache.commons.beanutils.converters.BooleanConverter).
log4j:WARN Please initialize the log4j system properly.
[INFO] 
[INFO] --- cobertura-maven-plugin:2.4:clean (default) @ abdera2 ---
[INFO] 
[INFO] --- maven-bundle-plugin:2.1.0:cleanVersions (default) @ abdera2 ---
[INFO] 
[INFO] --- maven-remote-resources-plugin:1.0:process (compile) @ abdera2 ---
[INFO] Setting property: classpath.resource.loader.class => 'org.codehaus.plexus.velocity.ContextClassLoaderResourceLoader'.
[INFO] Setting property: velocimacro.messages.on => 'false'.
[INFO] Setting property: resource.loader => 'classpath'.
[INFO] Setting property: resource.manager.logwhenfound => 'false'.
[INFO] 
[INFO] --- maven-bundle-plugin:2.1.0:cleanVersions (default) @ abdera2 ---
[JENKINS] Archiving <https://builds.apache.org/job/Abdera2-trunk/ws/abdera2/pom.xml>
to /home/hudson/hudson/jobs/Abdera2-trunk/modules/org.apache.abdera2$abdera2/builds/2012-01-01_00-01-07/archive/org.apache.abdera2/abdera2/2.0-SNAPSHOT/abdera2-2.0-SNAPSHOT.pom
[INFO] ------------------------------------------------------------------------
[INFO] Reactor Summary:
[INFO] 
[INFO] Apache Abdera2 .................................... FAILURE [9.605s]
[INFO] Abdera2 Common Library ............................ SKIPPED
[INFO] Abdera2 Client .................................... SKIPPED
[INFO] Abdera2 Core ...................................... SKIPPED
[INFO] Abdera2 Server .................................... SKIPPED
[INFO] Abdera2 Activities ................................ SKIPPED
[INFO] Abdera2 Extensions ................................ SKIPPED
[INFO] Abdera2 Security .................................. SKIPPED
[INFO] Abdera2 Tests ..................................... SKIPPED
[INFO] Abdera Examples ................................... SKIPPED
[INFO] ------------------------------------------------------------------------
[INFO] BUILD FAILURE
[INFO] ------------------------------------------------------------------------
[INFO] Total time: 10.630s
[INFO] Finished at: Sun Jan 01 00:01:21 UTC 2012
[INFO] Final Memory: 12M/724M
[INFO] ------------------------------------------------------------------------
mavenExecutionResult exceptions not empty
message : Internal error: java.lang.NullPointerException
cause : null
Stack trace : 
org.apache.maven.InternalErrorException: Internal error: java.lang.NullPointerException
	at org.apache.maven.lifecycle.internal.BuilderCommon.handleBuildError(BuilderCommon.java:128)
	at org.apache.maven.lifecycle.internal.LifecycleModuleBuilder.buildProject(LifecycleModuleBuilder.java:95)
	at org.apache.maven.lifecycle.internal.LifecycleModuleBuilder.buildProject(LifecycleModuleBuilder.java:59)
	at org.apache.maven.lifecycle.internal.LifecycleStarter.singleThreadedBuild(LifecycleStarter.java:183)
	at org.apache.maven.lifecycle.internal.LifecycleStarter.execute(LifecycleStarter.java:161)
	at org.apache.maven.DefaultMaven.doExecute(DefaultMaven.java:319)
	at org.apache.maven.DefaultMaven.execute(DefaultMaven.java:156)
	at org.jvnet.hudson.maven3.launcher.Maven3Launcher.main(Maven3Launcher.java:79)
	at sun.reflect.NativeMethodAccessorImpl.invoke0(Native Method)
	at sun.reflect.NativeMethodAccessorImpl.invoke(NativeMethodAccessorImpl.java:39)
	at sun.reflect.DelegatingMethodAccessorImpl.invoke(DelegatingMethodAccessorImpl.java:25)
	at java.lang.reflect.Method.invoke(Method.java:597)
	at org.codehaus.plexus.classworlds.launcher.Launcher.launchStandard(Launcher.java:329)
	at org.codehaus.plexus.classworlds.launcher.Launcher.launch(Launcher.java:239)
	at org.jvnet.hudson.maven3.agent.Maven3Main.launch(Maven3Main.java:158)
	at hudson.maven.Maven3Builder.call(Maven3Builder.java:112)
	at hudson.maven.Maven3Builder.call(Maven3Builder.java:70)
	at hudson.remoting.UserRequest.perform(UserRequest.java:118)
	at hudson.remoting.UserRequest.perform(UserRequest.java:48)
	at hudson.remoting.Request$2.run(Request.java:287)
	at java.util.concurrent.Executors$RunnableAdapter.call(Executors.java:441)
	at java.util.concurrent.FutureTask$Sync.innerRun(FutureTask.java:303)
	at java.util.concurrent.FutureTask.run(FutureTask.java:138)
	at java.util.concurrent.ThreadPoolExecutor$Worker.runTask(ThreadPoolExecutor.java:886)
	at java.util.concurrent.ThreadPoolExecutor$Worker.run(ThreadPoolExecutor.java:908)
	at java.lang.Thread.run(Thread.java:662)
Caused by: java.lang.NullPointerException
	at hudson.maven.ExecutedMojo.getMojoClass(ExecutedMojo.java:114)
	at hudson.maven.ExecutedMojo.<init>(ExecutedMojo.java:99)
	at hudson.maven.Maven3Builder$MavenExecutionListener.recordExecutionTime(Maven3Builder.java:524)
	at hudson.maven.Maven3Builder$MavenExecutionListener.recordMojoSucceeded(Maven3Builder.java:493)
	at hudson.maven.Maven3Builder$MavenExecutionListener.forkSucceeded(Maven3Builder.java:601)
	at org.apache.maven.lifecycle.internal.DefaultExecutionEventCatapult.fire(DefaultExecutionEventCatapult.java:97)
	at org.apache.maven.lifecycle.internal.DefaultExecutionEventCatapult.fire(DefaultExecutionEventCatapult.java:42)
	at org.apache.maven.lifecycle.internal.MojoExecutor.executeForkedExecutions(MojoExecutor.java:383)
	at org.apache.maven.lifecycle.internal.MojoExecutor.execute(MojoExecutor.java:199)
	at org.apache.maven.lifecycle.internal.MojoExecutor.execute(MojoExecutor.java:153)
	at org.apache.maven.lifecycle.internal.MojoExecutor.execute(MojoExecutor.java:145)
	at org.apache.maven.lifecycle.internal.LifecycleModuleBuilder.buildProject(LifecycleModuleBuilder.java:84)
	... 24 more
Sending e-mails to: dev@abdera.apache.org
channel stopped


Mime
View raw message