abdera-dev mailing list archives

Site index · List index
Message view « Date » · « Thread »
Top « Date » · « Thread »
From Apache Jenkins Server <jenk...@builds.apache.org>
Subject Build failed in Jenkins: Abdera-trunk #518
Date Sat, 01 Oct 2011 00:04:24 GMT
See <https://builds.apache.org/job/Abdera-trunk/518/>

------------------------------------------
[...truncated 3374 lines...]
[INFO] Building Abdera Extensions - Features 1.2-SNAPSHOT
[INFO] ------------------------------------------------------------------------
[INFO] 
[INFO] --- maven-clean-plugin:2.4.1:clean (default-clean) @ abdera-extensions-features ---
[INFO] 
[INFO] --- cobertura-maven-plugin:2.4:clean (default) @ abdera-extensions-features ---
[INFO] 
[INFO] --- maven-bundle-plugin:2.1.0:cleanVersions (default) @ abdera-extensions-features
---
[INFO] 
[INFO] --- maven-remote-resources-plugin:1.0:process (compile) @ abdera-extensions-features
---
[INFO] [INFO] Using 'UTF-8' encoding to copy filtered resources.

[INFO] --- maven-resources-plugin:2.4.3:resources (default-resources) @ abdera-extensions-features
---
[INFO] Copying 1 resource
[INFO] Copying 2 resources
[INFO] [INFO] Compiling 9 source files to <https://builds.apache.org/job/Abdera-trunk/ws/trunk/extensions/features/target/classes>

[INFO] --- maven-compiler-plugin:2.3.2:compile (default-compile) @ abdera-extensions-features
---
[INFO] [INFO] Using 'UTF-8' encoding to copy filtered resources.
[INFO] Copying 0 resource

[INFO] Copying 2 resources
[INFO] --- maven-resources-plugin:2.4.3:testResources (default-testResources) @ abdera-extensions-features
---
[INFO] 
[INFO] --- maven-compiler-plugin:2.3.2:testCompile (default-testCompile) @ abdera-extensions-features
---
[INFO] Compiling 2 source files to <https://builds.apache.org/job/Abdera-trunk/ws/trunk/extensions/features/target/test-classes>
[INFO] [INFO] Surefire report directory: <https://builds.apache.org/job/Abdera-trunk/ws/trunk/extensions/features/target/surefire-reports>

[INFO] --- maven-surefire-plugin:2.6:test (default-test) @ abdera-extensions-features ---

-------------------------------------------------------
 T E S T S
-------------------------------------------------------
Running org.apache.abdera.test.ext.features.FeatureTest
Tests run: 4, Failures: 0, Errors: 0, Skipped: 0, Time elapsed: 0.274 sec

Results :

Tests run: 4, Failures: 0, Errors: 0, Skipped: 0

[JENKINS] Recording test results
[INFO] [INFO] Building jar: <https://builds.apache.org/job/Abdera-trunk/ws/trunk/extensions/features/target/abdera-extensions-features-1.2-SNAPSHOT.jar>

[INFO] --- maven-jar-plugin:2.2:jar (default-jar) @ abdera-extensions-features ---
[INFO] 
[INFO] --- maven-bundle-plugin:2.1.0:cleanVersions (default) @ abdera-extensions-features
---
[JENKINS] Archiving <https://builds.apache.org/job/Abdera-trunk/ws/trunk/extensions/features/pom.xml>
to /home/hudson/hudson/jobs/Abdera-trunk/modules/org.apache.abdera$abdera-extensions-features/builds/2011-10-01_00-00-47/archive/org.apache.abdera/abdera-extensions-features/1.2-SNAPSHOT/abdera-extensions-features-1.2-SNAPSHOT.pom
[JENKINS] Archiving <https://builds.apache.org/job/Abdera-trunk/ws/trunk/extensions/features/target/abdera-extensions-features-1.2-SNAPSHOT.jar>
to /home/hudson/hudson/jobs/Abdera-trunk/modules/org.apache.abdera$abdera-extensions-features/builds/2011-10-01_00-00-47/archive/org.apache.abdera/abdera-extensions-features/1.2-SNAPSHOT/abdera-extensions-features-1.2-SNAPSHOT.jar
ignoring exception during new ExecutedMojo null
[INFO] 
[INFO] --- maven-source-plugin:2.1.2:jar (attach-sources) @ abdera-extensions-features ---
[INFO] META-INF already added, skipping
[INFO] META-INF already added, skipping
[INFO] META-INF/NOTICE already added, skipping
[INFO] META-INF/LICENSE already added, skipping
[INFO] Building jar: <https://builds.apache.org/job/Abdera-trunk/ws/trunk/extensions/features/target/abdera-extensions-features-1.2-SNAPSHOT-sources.jar>
[INFO] META-INF already added, skipping
[INFO] META-INF already added, skipping
[INFO] META-INF/NOTICE already added, skipping
[INFO] META-INF/LICENSE already added, skipping
[INFO] [INFO] Installing <https://builds.apache.org/job/Abdera-trunk/ws/trunk/extensions/features/target/abdera-extensions-features-1.2-SNAPSHOT.jar>
to /home/jenkins/.m2/repository/org/apache/abdera/abdera-extensions-features/1.2-SNAPSHOT/abdera-extensions-features-1.2-SNAPSHOT.jar

[INFO] --- maven-install-plugin:2.3.1:install (default-install) @ abdera-extensions-features
---[INFO] Installing <https://builds.apache.org/job/Abdera-trunk/ws/trunk/extensions/features/pom.xml>
to /home/jenkins/.m2/repository/org/apache/abdera/abdera-extensions-features/1.2-SNAPSHOT/abdera-extensions-features-1.2-SNAPSHOT.pom

[INFO] Installing <https://builds.apache.org/job/Abdera-trunk/ws/trunk/extensions/features/target/abdera-extensions-features-1.2-SNAPSHOT-sources.jar>
to /home/jenkins/.m2/repository/org/apache/abdera/abdera-extensions-features/1.2-SNAPSHOT/abdera-extensions-features-1.2-SNAPSHOT-sources.jar
[JENKINS] Archiving <https://builds.apache.org/job/Abdera-trunk/ws/trunk/extensions/features/target/abdera-extensions-features-1.2-SNAPSHOT-sources.jar>
to /home/hudson/hudson/jobs/Abdera-trunk/modules/org.apache.abdera$abdera-extensions-features/builds/2011-10-01_00-00-47/archive/org.apache.abdera/abdera-extensions-features/1.2-SNAPSHOT/abdera-extensions-features-1.2-SNAPSHOT-sources.jar
[INFO] [INFO] Deleting <https://builds.apache.org/job/Abdera-trunk/ws/trunk/extensions/target>
                                                                        
[INFO] ------------------------------------------------------------------------
[INFO] Building Abdera Extensions 1.2-SNAPSHOT
[INFO] ------------------------------------------------------------------------
[INFO] 
[INFO] --- maven-clean-plugin:2.4.1:clean (default-clean) @ abdera-extensions-parent ---
[INFO] 
[INFO] --- cobertura-maven-plugin:2.4:clean (default) @ abdera-extensions-parent ---
[INFO] 
[INFO] --- maven-bundle-plugin:2.1.0:cleanVersions (default) @ abdera-extensions-parent ---
[INFO] 
[INFO] --- maven-remote-resources-plugin:1.0:process (compile) @ abdera-extensions-parent
---
[INFO] 
[INFO] --- maven-bundle-plugin:2.1.0:cleanVersions (default) @ abdera-extensions-parent ---
[JENKINS] Archiving <https://builds.apache.org/job/Abdera-trunk/ws/trunk/extensions/pom.xml>
to /home/hudson/hudson/jobs/Abdera-trunk/modules/org.apache.abdera$abdera-extensions-parent/builds/2011-10-01_00-00-47/archive/org.apache.abdera/abdera-extensions-parent/1.2-SNAPSHOT/abdera-extensions-parent-1.2-SNAPSHOT.pom
ignoring exception during new ExecutedMojo null
[INFO] 
[INFO] --- maven-source-plugin:2.1.2:jar (attach-sources) @ abdera-extensions-parent ---
[INFO] [INFO] Installing <https://builds.apache.org/job/Abdera-trunk/ws/trunk/extensions/pom.xml>
to /home/jenkins/.m2/repository/org/apache/abdera/abdera-extensions-parent/1.2-SNAPSHOT/abdera-extensions-parent-1.2-SNAPSHOT.pom

[INFO] --- maven-install-plugin:2.3.1:install (default-install) @ abdera-extensions-parent
---
[INFO] [INFO] Deleting <https://builds.apache.org/job/Abdera-trunk/ws/trunk/examples/target>
                                                                        
[INFO] ------------------------------------------------------------------------
[INFO] Building Abdera Examples 1.2-SNAPSHOT
[INFO] ------------------------------------------------------------------------
[INFO] 
[INFO] --- maven-clean-plugin:2.4.1:clean (default-clean) @ abdera-examples ---
[INFO] 
[INFO] --- cobertura-maven-plugin:2.4:clean (default) @ abdera-examples ---
[INFO] 
[INFO] --- maven-bundle-plugin:2.1.0:cleanVersions (default) @ abdera-examples ---
[INFO] 
[INFO] --- maven-remote-resources-plugin:1.0:process (compile) @ abdera-examples ---
[INFO] [INFO] Using 'UTF-8' encoding to copy filtered resources.

[INFO] --- maven-resources-plugin:2.4.3:resources (default-resources) @ abdera-examples ---
[INFO] Copying 10 resources
[INFO] Copying 2 resources
[INFO] 
[INFO] --- maven-compiler-plugin:2.3.2:compile (default-compile) @ abdera-examples ---
[INFO] Compiling 44 source files to <https://builds.apache.org/job/Abdera-trunk/ws/trunk/examples/target/classes>
[INFO] [INFO] Using 'UTF-8' encoding to copy filtered resources.
[INFO] skip non existing resourceDirectory <https://builds.apache.org/job/Abdera-trunk/ws/trunk/examples/src/test/resources>
[INFO] Copying 2 resources

[INFO] --- maven-resources-plugin:2.4.3:testResources (default-testResources) @ abdera-examples
---
[INFO] [INFO] No sources to compile

[INFO] --- maven-compiler-plugin:2.3.2:testCompile (default-testCompile) @ abdera-examples
---
[INFO] [INFO] Surefire report directory: <https://builds.apache.org/job/Abdera-trunk/ws/trunk/examples/target/surefire-reports>

[INFO] --- maven-surefire-plugin:2.6:test (default-test) @ abdera-examples ---

-------------------------------------------------------
 T E S T S
-------------------------------------------------------
There are no tests to run.

Results :

Tests run: 0, Failures: 0, Errors: 0, Skipped: 0

[JENKINS] Recording test results
[INFO] [INFO] Building jar: <https://builds.apache.org/job/Abdera-trunk/ws/trunk/examples/target/abdera-examples-1.2-SNAPSHOT.jar>

[INFO] --- maven-jar-plugin:2.2:jar (default-jar) @ abdera-examples ---
[INFO] 
[INFO] --- maven-bundle-plugin:2.1.0:cleanVersions (default) @ abdera-examples ---
[JENKINS] Archiving <https://builds.apache.org/job/Abdera-trunk/ws/trunk/examples/pom.xml>
to /home/hudson/hudson/jobs/Abdera-trunk/modules/org.apache.abdera$abdera-examples/builds/2011-10-01_00-00-47/archive/org.apache.abdera/abdera-examples/1.2-SNAPSHOT/abdera-examples-1.2-SNAPSHOT.pom
[JENKINS] Archiving <https://builds.apache.org/job/Abdera-trunk/ws/trunk/examples/target/abdera-examples-1.2-SNAPSHOT.jar>
to /home/hudson/hudson/jobs/Abdera-trunk/modules/org.apache.abdera$abdera-examples/builds/2011-10-01_00-00-47/archive/org.apache.abdera/abdera-examples/1.2-SNAPSHOT/abdera-examples-1.2-SNAPSHOT.jar
ignoring exception during new ExecutedMojo null
[INFO] 
[INFO] --- maven-source-plugin:2.1.2:jar (attach-sources) @ abdera-examples ---
[INFO] META-INF already added, skipping
[INFO] org already added, skipping
[INFO] org/apache already added, skipping
[INFO] org/apache/abdera already added, skipping
[INFO] org/apache/abdera/examples already added, skipping
[INFO] org/apache/abdera/examples/appserver already added, skipping
[INFO] META-INF already added, skipping
[INFO] META-INF/NOTICE already added, skipping
[INFO] META-INF/LICENSE already added, skipping
[INFO] Building jar: <https://builds.apache.org/job/Abdera-trunk/ws/trunk/examples/target/abdera-examples-1.2-SNAPSHOT-sources.jar>
[INFO] META-INF already added, skipping
[INFO] org already added, skipping
[INFO] org/apache already added, skipping
[INFO] org/apache/abdera already added, skipping
[INFO] org/apache/abdera/examples already added, skipping
[INFO] org/apache/abdera/examples/appserver already added, skipping
[INFO] META-INF already added, skipping
[INFO] META-INF/NOTICE already added, skipping
[INFO] META-INF/LICENSE already added, skipping
[INFO] [INFO] Installing <https://builds.apache.org/job/Abdera-trunk/ws/trunk/examples/target/abdera-examples-1.2-SNAPSHOT.jar>
to /home/jenkins/.m2/repository/org/apache/abdera/abdera-examples/1.2-SNAPSHOT/abdera-examples-1.2-SNAPSHOT.jar
[INFO] Installing <https://builds.apache.org/job/Abdera-trunk/ws/trunk/examples/pom.xml>
to /home/jenkins/.m2/repository/org/apache/abdera/abdera-examples/1.2-SNAPSHOT/abdera-examples-1.2-SNAPSHOT.pom

[INFO] --- maven-install-plugin:2.3.1:install (default-install) @ abdera-examples ---
[INFO] Installing <https://builds.apache.org/job/Abdera-trunk/ws/trunk/examples/target/abdera-examples-1.2-SNAPSHOT-sources.jar>
to /home/jenkins/.m2/repository/org/apache/abdera/abdera-examples/1.2-SNAPSHOT/abdera-examples-1.2-SNAPSHOT-sources.jar
[JENKINS] Archiving <https://builds.apache.org/job/Abdera-trunk/ws/trunk/examples/target/abdera-examples-1.2-SNAPSHOT-sources.jar>
to /home/hudson/hudson/jobs/Abdera-trunk/modules/org.apache.abdera$abdera-examples/builds/2011-10-01_00-00-47/archive/org.apache.abdera/abdera-examples/1.2-SNAPSHOT/abdera-examples-1.2-SNAPSHOT-sources.jar
[INFO] ------------------------------------------------------------------------
[INFO] Reactor Summary:
[INFO] 
[INFO] Apache Abdera ..................................... SUCCESS [4.838s]
[INFO] I18N Libraries .................................... SUCCESS [19.185s]
[INFO] Abdera Core ....................................... SUCCESS [7.363s]
[INFO] Abdera Parser ..................................... SUCCESS [10.553s]
[INFO] Abdera Client ..................................... SUCCESS [7.236s]
[INFO] Abdera Server ..................................... SUCCESS [9.676s]
[INFO] Abdera Spring Integration ......................... SUCCESS [6.033s]
[INFO] Abdera Adapters ................................... SUCCESS [0.973s]
[INFO] Abdera JCR Adapter ................................ SUCCESS [11.123s]
[INFO] Abdera Filesystem Adapter ......................... SUCCESS [5.548s]
[INFO] Abdera JDBC Adapter ............................... SUCCESS [4.796s]
[INFO] Abdera Security ................................... SUCCESS [8.037s]
[INFO] Abdera Extensions - GData ......................... SUCCESS [6.986s]
[INFO] Abdera Extensions - Geo ........................... SUCCESS [5.175s]
[INFO] Abdera Extensions - HTML .......................... SUCCESS [4.975s]
[INFO] Abdera Extensions - Main .......................... SUCCESS [6.037s]
[INFO] Abdera Extensions - JSON .......................... SUCCESS [6.035s]
[INFO] Abdera Extensions - Media ......................... SUCCESS [6.306s]
[INFO] Abdera Extensions - OAuth ......................... SUCCESS [7.975s]
[INFO] Abdera Extensions - OpenSearch .................... SUCCESS [8.143s]
[INFO] Abdera Extensions - Serializer .................... SUCCESS [6.980s]
[INFO] Abdera Extensions - Sharing ....................... SUCCESS [6.097s]
[INFO] Abdera Extensions - WSSE .......................... SUCCESS [5.148s]
[INFO] Abdera Bundle Jar ................................. SUCCESS [13.211s]
[INFO] Abdera Extensions - RSS ........................... SUCCESS [6.566s]
[INFO] Abdera Extensions - Features ...................... SUCCESS [3.716s]
[INFO] Abdera Extensions ................................. SUCCESS [0.903s]
[INFO] Abdera Examples ................................... SUCCESS [4.585s]
[INFO] ------------------------------------------------------------------------
[INFO] BUILD SUCCESS
[INFO] ------------------------------------------------------------------------
[INFO] Total time: 3:31.676s
[INFO] Finished at: Sat Oct 01 00:04:22 GMT 2011
[INFO] Final Memory: 72M/747M
[INFO] ------------------------------------------------------------------------
Waiting for Jenkins to finish collecting data
channel stopped
Maven RedeployPublished use remote ubuntu3 maven settings from : /home/jenkins/.m2/settings.xml
[ERROR] uniqueVersion == false is not anymore supported in maven 3
[INFO] Deployment in https://repository.apache.org/content/repositories/snapshots (id=,uniqueVersion=false)
Deploying the main artifact abdera-1.2-SNAPSHOT.pom
Downloading: https://repository.apache.org/content/repositories/snapshots/org/apache/abdera/abdera/1.2-SNAPSHOT/maven-metadata.xml
Downloaded: https://repository.apache.org/content/repositories/snapshots/org/apache/abdera/abdera/1.2-SNAPSHOT/maven-metadata.xml
(598 B at 1.1 KB/sec)
Uploading: https://repository.apache.org/content/repositories/snapshots/org/apache/abdera/abdera/1.2-SNAPSHOT/abdera-1.2-20111001.000424-66.pom
Uploading: https://repository.apache.org/content/repositories/snapshots/org/apache/abdera/abdera/1.2-SNAPSHOT/abdera-1.2-20111001.000424-66.pom
ERROR: Failed to deploy artifacts: Could not transfer artifact org.apache.abdera:abdera:pom:1.2-20111001.000424-66
from/to  (https://repository.apache.org/content/repositories/snapshots): Failed to transfer
file: https://repository.apache.org/content/repositories/snapshots/org/apache/abdera/abdera/1.2-SNAPSHOT/abdera-1.2-20111001.000424-66.pom.
Return code is: 401
org.apache.maven.artifact.deployer.ArtifactDeploymentException: Failed to deploy artifacts:
Could not transfer artifact org.apache.abdera:abdera:pom:1.2-20111001.000424-66 from/to  (https://repository.apache.org/content/repositories/snapshots):
Failed to transfer file: https://repository.apache.org/content/repositories/snapshots/org/apache/abdera/abdera/1.2-SNAPSHOT/abdera-1.2-20111001.000424-66.pom.
Return code is: 401
	at org.apache.maven.artifact.deployer.DefaultArtifactDeployer.deploy(DefaultArtifactDeployer.java:141)
	at hudson.maven.reporters.MavenArtifactRecord.deploy(MavenArtifactRecord.java:189)
	at hudson.maven.RedeployPublisher.perform(RedeployPublisher.java:158)
	at hudson.tasks.BuildStepMonitor$1.perform(BuildStepMonitor.java:19)
	at hudson.model.AbstractBuild$AbstractRunner.perform(AbstractBuild.java:693)
	at hudson.model.AbstractBuild$AbstractRunner.performAllBuildSteps(AbstractBuild.java:668)
	at hudson.maven.MavenModuleSetBuild$RunnerImpl.post2(MavenModuleSetBuild.java:953)
	at hudson.model.AbstractBuild$AbstractRunner.post(AbstractBuild.java:615)
	at hudson.model.Run.run(Run.java:1401)
	at hudson.maven.MavenModuleSetBuild.run(MavenModuleSetBuild.java:474)
	at hudson.model.ResourceController.execute(ResourceController.java:88)
	at hudson.model.Executor.run(Executor.java:230)
Caused by: org.sonatype.aether.deployment.DeploymentException: Failed to deploy artifacts:
Could not transfer artifact org.apache.abdera:abdera:pom:1.2-20111001.000424-66 from/to  (https://repository.apache.org/content/repositories/snapshots):
Failed to transfer file: https://repository.apache.org/content/repositories/snapshots/org/apache/abdera/abdera/1.2-SNAPSHOT/abdera-1.2-20111001.000424-66.pom.
Return code is: 401
	at org.sonatype.aether.impl.internal.DefaultDeployer.deploy(DefaultDeployer.java:284)
	at org.sonatype.aether.impl.internal.DefaultDeployer.deploy(DefaultDeployer.java:215)
	at org.sonatype.aether.impl.internal.DefaultRepositorySystem.deploy(DefaultRepositorySystem.java:480)
	at org.apache.maven.artifact.deployer.DefaultArtifactDeployer.deploy(DefaultArtifactDeployer.java:137)
	... 11 more
Caused by: org.sonatype.aether.transfer.ArtifactTransferException: Could not transfer artifact
org.apache.abdera:abdera:pom:1.2-20111001.000424-66 from/to  (https://repository.apache.org/content/repositories/snapshots):
Failed to transfer file: https://repository.apache.org/content/repositories/snapshots/org/apache/abdera/abdera/1.2-SNAPSHOT/abdera-1.2-20111001.000424-66.pom.
Return code is: 401
	at org.sonatype.aether.connector.wagon.WagonRepositoryConnector$4.wrap(WagonRepositoryConnector.java:949)
	at org.sonatype.aether.connector.wagon.WagonRepositoryConnector$4.wrap(WagonRepositoryConnector.java:940)
	at org.sonatype.aether.connector.wagon.WagonRepositoryConnector$PutTask.flush(WagonRepositoryConnector.java:864)
	at org.sonatype.aether.connector.wagon.WagonRepositoryConnector.put(WagonRepositoryConnector.java:466)
	at org.sonatype.aether.impl.internal.DefaultDeployer.deploy(DefaultDeployer.java:278)
	... 14 more
Caused by: org.apache.maven.wagon.TransferFailedException: Failed to transfer file: https://repository.apache.org/content/repositories/snapshots/org/apache/abdera/abdera/1.2-SNAPSHOT/abdera-1.2-20111001.000424-66.pom.
Return code is: 401
	at org.apache.maven.wagon.shared.http.AbstractHttpClientWagon.put(AbstractHttpClientWagon.java:368)
	at org.apache.maven.wagon.shared.http.AbstractHttpClientWagon.put(AbstractHttpClientWagon.java:280)
	at org.sonatype.aether.connector.wagon.WagonRepositoryConnector$PutTask.run(WagonRepositoryConnector.java:825)
	at org.sonatype.aether.connector.wagon.WagonRepositoryConnector.put(WagonRepositoryConnector.java:465)
	... 15 more
[INFO] Deployment failed after 0.92 sec
Build step 'Deploy artifacts to Maven repository' changed build result to FAILURE


Mime
View raw message