abdera-dev mailing list archives

Site index · List index
Message view « Date » · « Thread »
Top « Date » · « Thread »
From Apache Jenkins Server <jenk...@builds.apache.org>
Subject Build failed in Jenkins: Abdera2-trunk #5
Date Mon, 26 Sep 2011 07:12:28 GMT
See <https://builds.apache.org/job/Abdera2-trunk/5/changes>

Changes:

[jmsnell] Silly jdk generics issues are gonna be the death of me.

------------------------------------------
[...truncated 1164 lines...]

[JENKINS] Recording test results
[INFO] 
[INFO] --- maven-bundle-plugin:2.1.0:bundle (default-bundle) @ abdera2-common ---
[WARNING] Warning building bundle org.apache.abdera2:abdera2-common:bundle:2.0-SNAPSHOT :
Instructions in Export-Package that are never used: org\.apache\.abdera\..*|org\.apache\.abdera
[WARNING] Warning building bundle org.apache.abdera2:abdera2-common:bundle:2.0-SNAPSHOT :
Superfluous export-package instructions: [org.apache.abdera.*]
[WARNING] Warning building bundle org.apache.abdera2:abdera2-common:bundle:2.0-SNAPSHOT :
Did not find matching referal for org.apache.abdera.*
[INFO] 
[INFO] --- maven-bundle-plugin:2.1.0:cleanVersions (default) @ abdera2-common ---
[JENKINS] Archiving <https://builds.apache.org/job/Abdera2-trunk/ws/abdera2/common/pom.xml>
to /home/hudson/hudson/jobs/Abdera2-trunk/modules/org.apache.abdera2$abdera2-common/builds/2011-09-26_07-11-13/archive/org.apache.abdera2/abdera2-common/2.0-SNAPSHOT/abdera2-common-2.0-SNAPSHOT.pom
[JENKINS] Archiving <https://builds.apache.org/job/Abdera2-trunk/ws/abdera2/common/target/abdera2-common-2.0-SNAPSHOT.jar>
to /home/hudson/hudson/jobs/Abdera2-trunk/modules/org.apache.abdera2$abdera2-common/builds/2011-09-26_07-11-13/archive/org.apache.abdera2/abdera2-common/2.0-SNAPSHOT/abdera2-common-2.0-SNAPSHOT.jar
ignoring exception during new ExecutedMojo null
[INFO] 
[INFO] --- maven-source-plugin:2.1.2:jar (attach-sources) @ abdera2-common ---
[INFO] META-INF already added, skipping
[INFO] META-INF/NOTICE already added, skipping
[INFO] META-INF/LICENSE already added, skipping
[INFO] Building jar: <https://builds.apache.org/job/Abdera2-trunk/ws/abdera2/common/target/abdera2-common-2.0-SNAPSHOT-sources.jar>
[INFO] META-INF already added, skipping
[INFO] META-INF/NOTICE already added, skipping
[INFO] META-INF/LICENSE already added, skipping
[INFO] [INFO] Installing <https://builds.apache.org/job/Abdera2-trunk/ws/abdera2/common/target/abdera2-common-2.0-SNAPSHOT.jar>
to /home/jenkins/.m2/repository/org/apache/abdera2/abdera2-common/2.0-SNAPSHOT/abdera2-common-2.0-SNAPSHOT.jar
[INFO] Installing <https://builds.apache.org/job/Abdera2-trunk/ws/abdera2/common/pom.xml>
to /home/jenkins/.m2/repository/org/apache/abdera2/abdera2-common/2.0-SNAPSHOT/abdera2-common-2.0-SNAPSHOT.pom
[INFO] Installing <https://builds.apache.org/job/Abdera2-trunk/ws/abdera2/common/target/abdera2-common-2.0-SNAPSHOT-sources.jar>
to /home/jenkins/.m2/repository/org/apache/abdera2/abdera2-common/2.0-SNAPSHOT/abdera2-common-2.0-SNAPSHOT-sources.jar

[INFO] --- maven-install-plugin:2.3.1:install (default-install) @ abdera2-common ---
[INFO] 
[INFO] --- maven-bundle-plugin:2.1.0:install (default-install) @ abdera2-common ---
[INFO] Installing org/apache/abdera2/abdera2-common/2.0-SNAPSHOT/abdera2-common-2.0-SNAPSHOT.jar
[INFO] Writing OBR metadata
[JENKINS] Archiving <https://builds.apache.org/job/Abdera2-trunk/ws/abdera2/common/target/abdera2-common-2.0-SNAPSHOT-sources.jar>
to /home/hudson/hudson/jobs/Abdera2-trunk/modules/org.apache.abdera2$abdera2-common/builds/2011-09-26_07-11-13/archive/org.apache.abdera2/abdera2-common/2.0-SNAPSHOT/abdera2-common-2.0-SNAPSHOT-sources.jar
Downloading: http://repo1.maven.org/maven2/org/apache/maven/plugins/maven-install-plugin/maven-metadata.xml
[INFO]                                                                         
[INFO] ------------------------------------------------------------------------
[INFO] Building Abdera2 Core 2.0-SNAPSHOT
[INFO] ------------------------------------------------------------------------
Downloaded: http://repo1.maven.org/maven2/org/apache/maven/plugins/maven-install-plugin/maven-metadata.xml
(503 B at 1.4 KB/sec)
Downloading: http://repo1.maven.org/maven2/org/apache/maven/plugins/maven-resources-plugin/maven-metadata.xml
Downloaded: http://repo1.maven.org/maven2/org/apache/maven/plugins/maven-resources-plugin/maven-metadata.xml
(657 B at 1.3 KB/sec)
Downloading: http://repo1.maven.org/maven2/org/apache/maven/plugins/maven-deploy-plugin/maven-metadata.xml
Downloaded: http://repo1.maven.org/maven2/org/apache/maven/plugins/maven-deploy-plugin/maven-metadata.xml
(614 B at 1.2 KB/sec)
Downloading: http://download.java.net/maven/2/org/apache/ws/commons/axiom/axiom-impl/1.2.12/axiom-impl-1.2.12.pom
Downloading: http://repo1.maven.org/maven2/org/apache/ws/commons/axiom/axiom-impl/1.2.12/axiom-impl-1.2.12.pom
Downloaded: http://repo1.maven.org/maven2/org/apache/ws/commons/axiom/axiom-impl/1.2.12/axiom-impl-1.2.12.pom
(6 KB at 15.4 KB/sec)
Downloading: http://download.java.net/maven/2/org/apache/ws/commons/axiom/axiom-parent/1.2.12/axiom-parent-1.2.12.pom
Downloading: http://repo1.maven.org/maven2/org/apache/ws/commons/axiom/axiom-parent/1.2.12/axiom-parent-1.2.12.pom
Downloaded: http://repo1.maven.org/maven2/org/apache/ws/commons/axiom/axiom-parent/1.2.12/axiom-parent-1.2.12.pom
(18 KB at 49.3 KB/sec)
Downloading: http://download.java.net/maven/2/org/apache/ws/commons/axiom/axiom-api/1.2.12/axiom-api-1.2.12.pom
Downloading: http://repo1.maven.org/maven2/org/apache/ws/commons/axiom/axiom-api/1.2.12/axiom-api-1.2.12.pom
Downloaded: http://repo1.maven.org/maven2/org/apache/ws/commons/axiom/axiom-api/1.2.12/axiom-api-1.2.12.pom
(16 KB at 37.8 KB/sec)
Downloading: http://download.java.net/maven/2/org/apache/ws/commons/axiom/axiom-impl/1.2.12/axiom-impl-1.2.12.jar
Downloading: http://download.java.net/maven/2/org/apache/ws/commons/axiom/axiom-api/1.2.12/axiom-api-1.2.12.jar
Downloading: http://repo1.maven.org/maven2/org/apache/ws/commons/axiom/axiom-impl/1.2.12/axiom-impl-1.2.12.jar
Downloading: http://repo1.maven.org/maven2/org/apache/ws/commons/axiom/axiom-api/1.2.12/axiom-api-1.2.12.jar
Downloaded: http://repo1.maven.org/maven2/org/apache/ws/commons/axiom/axiom-impl/1.2.12/axiom-impl-1.2.12.jar
(120 KB at 204.5 KB/sec)
Downloaded: http://repo1.maven.org/maven2/org/apache/ws/commons/axiom/axiom-api/1.2.12/axiom-api-1.2.12.jar
(421 KB at 494.1 KB/sec)
[INFO] 
[INFO] --- maven-clean-plugin:2.4.1:clean (default-clean) @ abdera2-core ---
[INFO] 
[INFO] --- cobertura-maven-plugin:2.4:clean (default) @ abdera2-core ---
[INFO] 
[INFO] --- maven-bundle-plugin:2.1.0:cleanVersions (default) @ abdera2-core ---
[INFO] 
[INFO] --- maven-remote-resources-plugin:1.0:process (compile) @ abdera2-core ---
[INFO] [debug] execute contextualize
[INFO] Using 'UTF-8' encoding to copy filtered resources.
[INFO] Copying 3 resources
[INFO] Copying 2 resources

[INFO] --- maven-resources-plugin:2.5:resources (default-resources) @ abdera2-core ---
[INFO] 
[INFO] --- maven-compiler-plugin:2.3.2:compile (default-compile) @ abdera2-core ---
[INFO] Compiling 121 source files to <https://builds.apache.org/job/Abdera2-trunk/ws/abdera2/core/target/classes>
[debug] execute contextualize
[INFO] [INFO] Using 'UTF-8' encoding to copy filtered resources.
[INFO] skip non existing resourceDirectory <https://builds.apache.org/job/Abdera2-trunk/ws/abdera2/core/src/test/resources>
[INFO] Copying 2 resources

[INFO] --- maven-resources-plugin:2.5:testResources (default-testResources) @ abdera2-core
---
[INFO] [INFO] No sources to compile

[INFO] --- maven-compiler-plugin:2.3.2:testCompile (default-testCompile) @ abdera2-core ---
[INFO] [INFO] Surefire report directory: <https://builds.apache.org/job/Abdera2-trunk/ws/abdera2/core/target/surefire-reports>

[INFO] --- maven-surefire-plugin:2.6:test (default-test) @ abdera2-core ---

-------------------------------------------------------
 T E S T S
-------------------------------------------------------
There are no tests to run.

Results :

Tests run: 0, Failures: 0, Errors: 0, Skipped: 0

[JENKINS] Recording test results
[INFO] 
[INFO] --- maven-bundle-plugin:2.1.0:bundle (default-bundle) @ abdera2-core ---
[WARNING] Warning building bundle org.apache.abdera2:abdera2-core:bundle:2.0-SNAPSHOT : Instructions
in Export-Package that are never used: org\.apache\.abdera\..*|org\.apache\.abdera
[WARNING] Warning building bundle org.apache.abdera2:abdera2-core:bundle:2.0-SNAPSHOT : Superfluous
export-package instructions: [org.apache.abdera.*]
[WARNING] Warning building bundle org.apache.abdera2:abdera2-core:bundle:2.0-SNAPSHOT : Did
not find matching referal for org.apache.abdera.*
[INFO] 
[INFO] --- maven-bundle-plugin:2.1.0:cleanVersions (default) @ abdera2-core ---
[JENKINS] Archiving <https://builds.apache.org/job/Abdera2-trunk/ws/abdera2/core/pom.xml>
to /home/hudson/hudson/jobs/Abdera2-trunk/modules/org.apache.abdera2$abdera2-core/builds/2011-09-26_07-11-13/archive/org.apache.abdera2/abdera2-core/2.0-SNAPSHOT/abdera2-core-2.0-SNAPSHOT.pom
[JENKINS] Archiving <https://builds.apache.org/job/Abdera2-trunk/ws/abdera2/core/target/abdera2-core-2.0-SNAPSHOT.jar>
to /home/hudson/hudson/jobs/Abdera2-trunk/modules/org.apache.abdera2$abdera2-core/builds/2011-09-26_07-11-13/archive/org.apache.abdera2/abdera2-core/2.0-SNAPSHOT/abdera2-core-2.0-SNAPSHOT.jar
ignoring exception during new ExecutedMojo null
[INFO] 
[INFO] --- maven-source-plugin:2.1.2:jar (attach-sources) @ abdera2-core ---
[INFO] META-INF already added, skipping
[INFO] META-INF already added, skipping
[INFO] META-INF/NOTICE already added, skipping
[INFO] META-INF/LICENSE already added, skipping
[INFO] Building jar: <https://builds.apache.org/job/Abdera2-trunk/ws/abdera2/core/target/abdera2-core-2.0-SNAPSHOT-sources.jar>
[INFO] META-INF already added, skipping
[INFO] META-INF already added, skipping
[INFO] META-INF/NOTICE already added, skipping
[INFO] META-INF/LICENSE already added, skipping
[INFO] [INFO] Installing <https://builds.apache.org/job/Abdera2-trunk/ws/abdera2/core/target/abdera2-core-2.0-SNAPSHOT.jar>
to /home/jenkins/.m2/repository/org/apache/abdera2/abdera2-core/2.0-SNAPSHOT/abdera2-core-2.0-SNAPSHOT.jar
[INFO] Installing <https://builds.apache.org/job/Abdera2-trunk/ws/abdera2/core/pom.xml>
to /home/jenkins/.m2/repository/org/apache/abdera2/abdera2-core/2.0-SNAPSHOT/abdera2-core-2.0-SNAPSHOT.pom
[INFO] Installing <https://builds.apache.org/job/Abdera2-trunk/ws/abdera2/core/target/abdera2-core-2.0-SNAPSHOT-sources.jar>
to /home/jenkins/.m2/repository/org/apache/abdera2/abdera2-core/2.0-SNAPSHOT/abdera2-core-2.0-SNAPSHOT-sources.jar

[INFO] --- maven-install-plugin:2.3.1:install (default-install) @ abdera2-core ---
[INFO] 
[INFO] --- maven-bundle-plugin:2.1.0:install (default-install) @ abdera2-core ---
[INFO] Installing org/apache/abdera2/abdera2-core/2.0-SNAPSHOT/abdera2-core-2.0-SNAPSHOT.jar
[INFO] Writing OBR metadata
[JENKINS] Archiving <https://builds.apache.org/job/Abdera2-trunk/ws/abdera2/core/target/abdera2-core-2.0-SNAPSHOT-sources.jar>
to /home/hudson/hudson/jobs/Abdera2-trunk/modules/org.apache.abdera2$abdera2-core/builds/2011-09-26_07-11-13/archive/org.apache.abdera2/abdera2-core/2.0-SNAPSHOT/abdera2-core-2.0-SNAPSHOT-sources.jar
[INFO] Downloading: http://repo1.maven.org/maven2/org/apache/maven/plugins/maven-install-plugin/maven-metadata.xml
                                                                        
[INFO] ------------------------------------------------------------------------
[INFO] Building Abdera2 Server 2.0-SNAPSHOT
[INFO] ------------------------------------------------------------------------
Downloaded: http://repo1.maven.org/maven2/org/apache/maven/plugins/maven-install-plugin/maven-metadata.xml
(503 B at 1.4 KB/sec)
Downloading: http://repo1.maven.org/maven2/org/apache/maven/plugins/maven-resources-plugin/maven-metadata.xml
Downloaded: http://repo1.maven.org/maven2/org/apache/maven/plugins/maven-resources-plugin/maven-metadata.xml
(657 B at 1.3 KB/sec)
Downloading: http://repo1.maven.org/maven2/org/apache/maven/plugins/maven-deploy-plugin/maven-metadata.xml
Downloaded: http://repo1.maven.org/maven2/org/apache/maven/plugins/maven-deploy-plugin/maven-metadata.xml
(614 B at 1.2 KB/sec)
[INFO] 
[INFO] --- maven-clean-plugin:2.4.1:clean (default-clean) @ abdera2-server ---
[INFO] 
[INFO] --- cobertura-maven-plugin:2.4:clean (default) @ abdera2-server ---
[INFO] 
[INFO] --- maven-bundle-plugin:2.1.0:cleanVersions (default) @ abdera2-server ---
[INFO] 
[INFO] --- maven-remote-resources-plugin:1.0:process (compile) @ abdera2-server ---
[debug] execute contextualize
[INFO] [INFO] Using 'UTF-8' encoding to copy filtered resources.
[INFO] Copying 0 resource
[INFO] Copying 2 resources

[INFO] --- maven-resources-plugin:2.5:resources (default-resources) @ abdera2-server ---
[INFO] [INFO] Compiling 41 source files to <https://builds.apache.org/job/Abdera2-trunk/ws/abdera2/server/target/classes>

[INFO] --- maven-compiler-plugin:2.3.2:compile (default-compile) @ abdera2-server ---
[INFO] -------------------------------------------------------------
[ERROR] COMPILATION ERROR : 
[INFO] -------------------------------------------------------------
[ERROR] <https://builds.apache.org/job/Abdera2-trunk/ws/abdera2/server/src/main/java/org/apache/abdera2/protocol/server/impl/AbstractAtompubProvider.java>:[289,26]
type parameters of <S>S cannot be determined; no unique maximal instance exists for
type variable S with upper bounds S,org.apache.abdera2.common.protocol.ResponseContext
[ERROR] <https://builds.apache.org/job/Abdera2-trunk/ws/abdera2/server/src/main/java/org/apache/abdera2/protocol/server/impl/AbstractAtompubCollectionAdapter.java>:[81,39]
type parameters of <S>S cannot be determined; no unique maximal instance exists for
type variable S with upper bounds S,org.apache.abdera2.common.protocol.ResponseContext
[ERROR] <https://builds.apache.org/job/Abdera2-trunk/ws/abdera2/server/src/main/java/org/apache/abdera2/protocol/server/provider/basic/BasicAdapter.java>:[120,34]
type parameters of <S>S cannot be determined; no unique maximal instance exists for
type variable S with upper bounds S,org.apache.abdera2.common.protocol.ResponseContext
[ERROR] <https://builds.apache.org/job/Abdera2-trunk/ws/abdera2/server/src/main/java/org/apache/abdera2/protocol/server/provider/basic/BasicAdapter.java>:[134,34]
type parameters of <S>S cannot be determined; no unique maximal instance exists for
type variable S with upper bounds S,org.apache.abdera2.common.protocol.ResponseContext
[ERROR] <https://builds.apache.org/job/Abdera2-trunk/ws/abdera2/server/src/main/java/org/apache/abdera2/protocol/server/processors/ServiceRequestProcessor.java>:[50,32]
type parameters of <S>S cannot be determined; no unique maximal instance exists for
type variable S with upper bounds S,org.apache.abdera2.common.protocol.ResponseContext
[ERROR] <https://builds.apache.org/job/Abdera2-trunk/ws/abdera2/server/src/main/java/org/apache/abdera2/protocol/server/processors/ServiceRequestProcessor.java>:[58,42]
type parameters of <S>S cannot be determined; no unique maximal instance exists for
type variable S with upper bounds S,org.apache.abdera2.common.protocol.ResponseContext
[ERROR] <https://builds.apache.org/job/Abdera2-trunk/ws/abdera2/server/src/main/java/org/apache/abdera2/protocol/server/impl/AbstractEntityCollectionAdapter.java>:[83,31]
type parameters of <S>S cannot be determined; no unique maximal instance exists for
type variable S with upper bounds S,org.apache.abdera2.common.protocol.ResponseContext
[ERROR] <https://builds.apache.org/job/Abdera2-trunk/ws/abdera2/server/src/main/java/org/apache/abdera2/protocol/server/impl/AbstractEntityCollectionAdapter.java>:[98,38]
type parameters of <S>S cannot be determined; no unique maximal instance exists for
type variable S with upper bounds S,org.apache.abdera2.common.protocol.ResponseContext
[ERROR] <https://builds.apache.org/job/Abdera2-trunk/ws/abdera2/server/src/main/java/org/apache/abdera2/protocol/server/impl/AbstractEntityCollectionAdapter.java>:[118,34]
type parameters of <S>S cannot be determined; no unique maximal instance exists for
type variable S with upper bounds S,org.apache.abdera2.common.protocol.ResponseContext
[ERROR] <https://builds.apache.org/job/Abdera2-trunk/ws/abdera2/server/src/main/java/org/apache/abdera2/protocol/server/impl/AbstractEntityCollectionAdapter.java>:[179,42]
type parameters of <S>S cannot be determined; no unique maximal instance exists for
type variable S with upper bounds S,org.apache.abdera2.common.protocol.ResponseContext
[ERROR] <https://builds.apache.org/job/Abdera2-trunk/ws/abdera2/server/src/main/java/org/apache/abdera2/protocol/server/impl/AbstractEntityCollectionAdapter.java>:[203,42]
type parameters of <S>S cannot be determined; no unique maximal instance exists for
type variable S with upper bounds S,org.apache.abdera2.common.protocol.ResponseContext
[ERROR] <https://builds.apache.org/job/Abdera2-trunk/ws/abdera2/server/src/main/java/org/apache/abdera2/protocol/server/impl/AbstractEntityCollectionAdapter.java>:[251,44]
type parameters of <S>S cannot be determined; no unique maximal instance exists for
type variable S with upper bounds S,org.apache.abdera2.common.protocol.ResponseContext
[ERROR] <https://builds.apache.org/job/Abdera2-trunk/ws/abdera2/server/src/main/java/org/apache/abdera2/protocol/server/impl/AbstractEntityCollectionAdapter.java>:[256,38]
type parameters of <S>S cannot be determined; no unique maximal instance exists for
type variable S with upper bounds S,org.apache.abdera2.common.protocol.ResponseContext
[ERROR] <https://builds.apache.org/job/Abdera2-trunk/ws/abdera2/server/src/main/java/org/apache/abdera2/protocol/server/impl/AbstractEntityCollectionAdapter.java>:[274,45]
type parameters of <S>S cannot be determined; no unique maximal instance exists for
type variable S with upper bounds S,org.apache.abdera2.common.protocol.ResponseContext
[ERROR] <https://builds.apache.org/job/Abdera2-trunk/ws/abdera2/server/src/main/java/org/apache/abdera2/protocol/server/impl/AbstractEntityCollectionAdapter.java>:[279,38]
type parameters of <S>S cannot be determined; no unique maximal instance exists for
type variable S with upper bounds S,org.apache.abdera2.common.protocol.ResponseContext
[ERROR] <https://builds.apache.org/job/Abdera2-trunk/ws/abdera2/server/src/main/java/org/apache/abdera2/protocol/server/impl/AbstractEntityCollectionAdapter.java>:[289,45]
type parameters of <S>S cannot be determined; no unique maximal instance exists for
type variable S with upper bounds S,org.apache.abdera2.common.protocol.ResponseContext
[ERROR] <https://builds.apache.org/job/Abdera2-trunk/ws/abdera2/server/src/main/java/org/apache/abdera2/protocol/server/impl/AbstractEntityCollectionAdapter.java>:[294,38]
type parameters of <S>S cannot be determined; no unique maximal instance exists for
type variable S with upper bounds S,org.apache.abdera2.common.protocol.ResponseContext
[ERROR] <https://builds.apache.org/job/Abdera2-trunk/ws/abdera2/server/src/main/java/org/apache/abdera2/protocol/server/impl/AbstractEntityCollectionAdapter.java>:[304,39]
type parameters of <S>S cannot be determined; no unique maximal instance exists for
type variable S with upper bounds S,org.apache.abdera2.common.protocol.ResponseContext
[ERROR] <https://builds.apache.org/job/Abdera2-trunk/ws/abdera2/server/src/main/java/org/apache/abdera2/protocol/server/impl/AbstractEntityCollectionAdapter.java>:[306,38]
type parameters of <S>S cannot be determined; no unique maximal instance exists for
type variable S with upper bounds S,org.apache.abdera2.common.protocol.ResponseContext
[ERROR] <https://builds.apache.org/job/Abdera2-trunk/ws/abdera2/server/src/main/java/org/apache/abdera2/protocol/server/impl/AbstractEntityCollectionAdapter.java>:[356,40]
type parameters of <S>S cannot be determined; no unique maximal instance exists for
type variable S with upper bounds S,org.apache.abdera2.common.protocol.ResponseContext
[ERROR] <https://builds.apache.org/job/Abdera2-trunk/ws/abdera2/server/src/main/java/org/apache/abdera2/protocol/server/impl/AbstractEntityCollectionAdapter.java>:[362,39]
type parameters of <T>T cannot be determined; no unique maximal instance exists for
type variable T with upper bounds S,org.apache.abdera2.common.protocol.ResponseContext
[ERROR] <https://builds.apache.org/job/Abdera2-trunk/ws/abdera2/server/src/main/java/org/apache/abdera2/protocol/server/impl/AbstractEntityCollectionAdapter.java>:[453,38]
type parameters of <S>S cannot be determined; no unique maximal instance exists for
type variable S with upper bounds S,org.apache.abdera2.common.protocol.ResponseContext
[ERROR] <https://builds.apache.org/job/Abdera2-trunk/ws/abdera2/server/src/main/java/org/apache/abdera2/protocol/server/impl/AbstractEntityCollectionAdapter.java>:[578,46]
type parameters of <S>S cannot be determined; no unique maximal instance exists for
type variable S with upper bounds S,org.apache.abdera2.common.protocol.ResponseContext
[ERROR] <https://builds.apache.org/job/Abdera2-trunk/ws/abdera2/server/src/main/java/org/apache/abdera2/protocol/server/impl/AbstractEntityCollectionAdapter.java>:[582,38]
type parameters of <S>S cannot be determined; no unique maximal instance exists for
type variable S with upper bounds S,org.apache.abdera2.common.protocol.ResponseContext
[ERROR] <https://builds.apache.org/job/Abdera2-trunk/ws/abdera2/server/src/main/java/org/apache/abdera2/protocol/server/impl/AbstractEntityCollectionAdapter.java>:[612,47]
type parameters of <S>S cannot be determined; no unique maximal instance exists for
type variable S with upper bounds S,org.apache.abdera2.common.protocol.ResponseContext
[ERROR] <https://builds.apache.org/job/Abdera2-trunk/ws/abdera2/server/src/main/java/org/apache/abdera2/protocol/server/impl/AbstractEntityCollectionAdapter.java>:[617,38]
type parameters of <S>S cannot be determined; no unique maximal instance exists for
type variable S with upper bounds S,org.apache.abdera2.common.protocol.ResponseContext
[ERROR] <https://builds.apache.org/job/Abdera2-trunk/ws/abdera2/server/src/main/java/org/apache/abdera2/protocol/server/impl/AbstractAtompubWorkspaceProvider.java>:[72,24]
type parameters of <S>S cannot be determined; no unique maximal instance exists for
type variable S with upper bounds S,org.apache.abdera2.common.protocol.ResponseContext
[ERROR] <https://builds.apache.org/job/Abdera2-trunk/ws/abdera2/server/src/main/java/org/apache/abdera2/protocol/server/processors/CategoriesRequestProcessor.java>:[41,41]
type parameters of <S>S cannot be determined; no unique maximal instance exists for
type variable S with upper bounds S,org.apache.abdera2.common.protocol.ResponseContext
[INFO] 28 errors 
[INFO] -------------------------------------------------------------
[JENKINS] Archiving <https://builds.apache.org/job/Abdera2-trunk/ws/abdera2/server/pom.xml>
to /home/hudson/hudson/jobs/Abdera2-trunk/modules/org.apache.abdera2$abdera2-server/builds/2011-09-26_07-11-13/archive/org.apache.abdera2/abdera2-server/2.0-SNAPSHOT/abdera2-server-2.0-SNAPSHOT.pom
[INFO] ------------------------------------------------------------------------
[INFO] Reactor Summary:
[INFO] 
[INFO] Apache Abdera2 .................................... SUCCESS [17.906s]
[INFO] Abdera2 Common Library ............................ SUCCESS [17.201s]
[INFO] Abdera2 Core ...................................... SUCCESS [18.250s]
[INFO] Abdera2 Server .................................... FAILURE [3.173s]
[INFO] Abdera2 Client .................................... SKIPPED
[INFO] Abdera2 Activities ................................ SKIPPED
[INFO] Abdera2 Extensions ................................ SKIPPED
[INFO] Abdera2 Security .................................. SKIPPED
[INFO] Abdera2 Tests ..................................... SKIPPED
[INFO] ------------------------------------------------------------------------
[INFO] BUILD FAILURE
[INFO] ------------------------------------------------------------------------
[INFO] Total time: 1:02.039s
[INFO] Finished at: Mon Sep 26 07:12:26 UTC 2011
[INFO] Final Memory: 25M/727M
[INFO] ------------------------------------------------------------------------
mavenExecutionResult exceptions not empty
message : Failed to execute goal org.apache.maven.plugins:maven-compiler-plugin:2.3.2:compile
(default-compile) on project abdera2-server: Compilation failure
cause : Compilation failure
Stack trace : 
org.apache.maven.lifecycle.LifecycleExecutionException: Failed to execute goal org.apache.maven.plugins:maven-compiler-plugin:2.3.2:compile
(default-compile) on project abdera2-server: Compilation failure
	at org.apache.maven.lifecycle.internal.MojoExecutor.execute(MojoExecutor.java:213)
	at org.apache.maven.lifecycle.internal.MojoExecutor.execute(MojoExecutor.java:153)
	at org.apache.maven.lifecycle.internal.MojoExecutor.execute(MojoExecutor.java:145)
	at org.apache.maven.lifecycle.internal.LifecycleModuleBuilder.buildProject(LifecycleModuleBuilder.java:84)
	at org.apache.maven.lifecycle.internal.LifecycleModuleBuilder.buildProject(LifecycleModuleBuilder.java:59)
	at org.apache.maven.lifecycle.internal.LifecycleStarter.singleThreadedBuild(LifecycleStarter.java:183)
	at org.apache.maven.lifecycle.internal.LifecycleStarter.execute(LifecycleStarter.java:161)
	at org.apache.maven.DefaultMaven.doExecute(DefaultMaven.java:319)
	at org.apache.maven.DefaultMaven.execute(DefaultMaven.java:156)
	at org.jvnet.hudson.maven3.launcher.Maven3Launcher.main(Maven3Launcher.java:79)
	at sun.reflect.NativeMethodAccessorImpl.invoke0(Native Method)
	at sun.reflect.NativeMethodAccessorImpl.invoke(NativeMethodAccessorImpl.java:39)
	at sun.reflect.DelegatingMethodAccessorImpl.invoke(DelegatingMethodAccessorImpl.java:25)
	at java.lang.reflect.Method.invoke(Method.java:597)
	at org.codehaus.plexus.classworlds.launcher.Launcher.launchStandard(Launcher.java:329)
	at org.codehaus.plexus.classworlds.launcher.Launcher.launch(Launcher.java:239)
	at org.jvnet.hudson.maven3.agent.Maven3Main.launch(Maven3Main.java:158)
	at hudson.maven.Maven3Builder.call(Maven3Builder.java:122)
	at hudson.maven.Maven3Builder.call(Maven3Builder.java:74)
	at hudson.remoting.UserRequest.perform(UserRequest.java:118)
	at hudson.remoting.UserRequest.perform(UserRequest.java:48)
	at hudson.remoting.Request$2.run(Request.java:287)
	at java.util.concurrent.Executors$RunnableAdapter.call(Executors.java:441)
	at java.util.concurrent.FutureTask$Sync.innerRun(FutureTask.java:303)
	at java.util.concurrent.FutureTask.run(FutureTask.java:138)
	at java.util.concurrent.ThreadPoolExecutor$Worker.runTask(ThreadPoolExecutor.java:886)
	at java.util.concurrent.ThreadPoolExecutor$Worker.run(ThreadPoolExecutor.java:908)
	at java.lang.Thread.run(Thread.java:619)
Caused by: org.apache.maven.plugin.CompilationFailureException: Compilation failure
	at org.apache.maven.plugin.AbstractCompilerMojo.execute(AbstractCompilerMojo.java:656)
	at org.apache.maven.plugin.CompilerMojo.execute(CompilerMojo.java:128)
	at org.apache.maven.plugin.DefaultBuildPluginManager.executeMojo(DefaultBuildPluginManager.java:101)
	at org.apache.maven.lifecycle.internal.MojoExecutor.execute(MojoExecutor.java:209)
	... 27 more
Sending e-mails to: dev@abdera.apache.org
Sending e-mails to: dev@abdera.apache.org
channel stopped


Mime
View raw message