abdera-dev mailing list archives

Site index · List index
Message view « Date » · « Thread »
Top « Date » · « Thread »
From Apache Jenkins Server <jenk...@builds.apache.org>
Subject Build failed in Jenkins: Abdera2-trunk #10
Date Mon, 26 Sep 2011 21:11:12 GMT
See <https://builds.apache.org/job/Abdera2-trunk/10/changes>

Changes:

[jmsnell] 

[jmsnell] 

------------------------------------------
[...truncated 280 lines...]
[JENKINS] Archiving <https://builds.apache.org/job/Abdera2-trunk/ws/abdera2/server/pom.xml>
to /home/hudson/hudson/jobs/Abdera2-trunk/modules/org.apache.abdera2$abdera2-server/builds/2011-09-26_21-10-06/archive/org.apache.abdera2/abdera2-server/2.0-SNAPSHOT/abdera2-server-2.0-SNAPSHOT.pom
[JENKINS] Archiving <https://builds.apache.org/job/Abdera2-trunk/ws/abdera2/server/target/abdera2-server-2.0-SNAPSHOT.jar>
to /home/hudson/hudson/jobs/Abdera2-trunk/modules/org.apache.abdera2$abdera2-server/builds/2011-09-26_21-10-06/archive/org.apache.abdera2/abdera2-server/2.0-SNAPSHOT/abdera2-server-2.0-SNAPSHOT.jar
ignoring exception during new ExecutedMojo null
[INFO] 
[INFO] --- maven-source-plugin:2.1.2:jar (attach-sources) @ abdera2-server ---
[INFO] META-INF already added, skipping
[INFO] META-INF/NOTICE already added, skipping
[INFO] META-INF/LICENSE already added, skipping
[INFO] Building jar: <https://builds.apache.org/job/Abdera2-trunk/ws/abdera2/server/target/abdera2-server-2.0-SNAPSHOT-sources.jar>
[INFO] META-INF already added, skipping
[INFO] META-INF/NOTICE already added, skipping
[INFO] META-INF/LICENSE already added, skipping
[INFO] [INFO] Installing <https://builds.apache.org/job/Abdera2-trunk/ws/abdera2/server/target/abdera2-server-2.0-SNAPSHOT.jar>
to /home/jenkins/.m2/repository/org/apache/abdera2/abdera2-server/2.0-SNAPSHOT/abdera2-server-2.0-SNAPSHOT.jar
[INFO] Installing <https://builds.apache.org/job/Abdera2-trunk/ws/abdera2/server/pom.xml>
to /home/jenkins/.m2/repository/org/apache/abdera2/abdera2-server/2.0-SNAPSHOT/abdera2-server-2.0-SNAPSHOT.pom

[INFO] --- maven-install-plugin:2.3.1:install (default-install) @ abdera2-server ---
[INFO] Installing <https://builds.apache.org/job/Abdera2-trunk/ws/abdera2/server/target/abdera2-server-2.0-SNAPSHOT-sources.jar>
to /home/jenkins/.m2/repository/org/apache/abdera2/abdera2-server/2.0-SNAPSHOT/abdera2-server-2.0-SNAPSHOT-sources.jar
[INFO] 
[INFO] --- maven-bundle-plugin:2.1.0:install (default-install) @ abdera2-server ---
[INFO] Installing org/apache/abdera2/abdera2-server/2.0-SNAPSHOT/abdera2-server-2.0-SNAPSHOT.jar
[INFO] Writing OBR metadata
[JENKINS] Archiving <https://builds.apache.org/job/Abdera2-trunk/ws/abdera2/server/target/abdera2-server-2.0-SNAPSHOT-sources.jar>
to /home/hudson/hudson/jobs/Abdera2-trunk/modules/org.apache.abdera2$abdera2-server/builds/2011-09-26_21-10-06/archive/org.apache.abdera2/abdera2-server/2.0-SNAPSHOT/abdera2-server-2.0-SNAPSHOT-sources.jar
[INFO] Downloading: http://repo1.maven.org/maven2/org/apache/maven/plugins/maven-install-plugin/maven-metadata.xml
                                                                        
[INFO] ------------------------------------------------------------------------
[INFO] Building Abdera2 Client 2.0-SNAPSHOT
[INFO] ------------------------------------------------------------------------
Downloaded: http://repo1.maven.org/maven2/org/apache/maven/plugins/maven-install-plugin/maven-metadata.xml
(503 B at 1.6 KB/sec)
Downloading: http://repo1.maven.org/maven2/org/apache/maven/plugins/maven-resources-plugin/maven-metadata.xml
Downloaded: http://repo1.maven.org/maven2/org/apache/maven/plugins/maven-resources-plugin/maven-metadata.xml
(657 B at 1.3 KB/sec)
[INFO] Downloading: http://repo1.maven.org/maven2/org/apache/maven/plugins/maven-deploy-plugin/maven-metadata.xml
Downloaded: http://repo1.maven.org/maven2/org/apache/maven/plugins/maven-deploy-plugin/maven-metadata.xml
(614 B at 1.2 KB/sec)
[INFO] Deleting <https://builds.apache.org/job/Abdera2-trunk/ws/abdera2/client/target>

[INFO] --- maven-clean-plugin:2.4.1:clean (default-clean) @ abdera2-client ---
[INFO] 
[INFO] --- cobertura-maven-plugin:2.4:clean (default) @ abdera2-client ---
[INFO] 
[INFO] --- maven-bundle-plugin:2.1.0:cleanVersions (default) @ abdera2-client ---
[INFO] 
[INFO] --- maven-remote-resources-plugin:1.0:process (compile) @ abdera2-client ---
[debug] execute contextualize
[INFO] [INFO] Using 'UTF-8' encoding to copy filtered resources.
[INFO] Copying 0 resource
[INFO] Copying 2 resources

[INFO] --- maven-resources-plugin:2.5:resources (default-resources) @ abdera2-client ---
[INFO] 
[INFO] --- maven-compiler-plugin:2.3.2:compile (default-compile) @ abdera2-client ---
[INFO] Compiling 22 source files to <https://builds.apache.org/job/Abdera2-trunk/ws/abdera2/client/target/classes>
[INFO] [debug] execute contextualize
[INFO] Using 'UTF-8' encoding to copy filtered resources.
[INFO] skip non existing resourceDirectory <https://builds.apache.org/job/Abdera2-trunk/ws/abdera2/client/src/test/resources>
[INFO] Copying 2 resources

[INFO] --- maven-resources-plugin:2.5:testResources (default-testResources) @ abdera2-client
---
[INFO] [INFO] No sources to compile

[INFO] --- maven-compiler-plugin:2.3.2:testCompile (default-testCompile) @ abdera2-client
---
[INFO] [INFO] Surefire report directory: <https://builds.apache.org/job/Abdera2-trunk/ws/abdera2/client/target/surefire-reports>

[INFO] --- maven-surefire-plugin:2.6:test (default-test) @ abdera2-client ---

-------------------------------------------------------
 T E S T S
-------------------------------------------------------
There are no tests to run.

Results :

Tests run: 0, Failures: 0, Errors: 0, Skipped: 0

[JENKINS] Recording test results
[INFO] 
[INFO] --- maven-bundle-plugin:2.1.0:bundle (default-bundle) @ abdera2-client ---
[WARNING] Warning building bundle org.apache.abdera2:abdera2-client:bundle:2.0-SNAPSHOT :
Instructions in Export-Package that are never used: org\.apache\.abdera\..*|org\.apache\.abdera
[WARNING] Warning building bundle org.apache.abdera2:abdera2-client:bundle:2.0-SNAPSHOT :
Superfluous export-package instructions: [org.apache.abdera.*]
[WARNING] Warning building bundle org.apache.abdera2:abdera2-client:bundle:2.0-SNAPSHOT :
Did not find matching referal for org.apache.abdera.*
[INFO] 
[INFO] --- maven-bundle-plugin:2.1.0:cleanVersions (default) @ abdera2-client ---
[JENKINS] Archiving <https://builds.apache.org/job/Abdera2-trunk/ws/abdera2/client/pom.xml>
to /home/hudson/hudson/jobs/Abdera2-trunk/modules/org.apache.abdera2$abdera2-client/builds/2011-09-26_21-10-06/archive/org.apache.abdera2/abdera2-client/2.0-SNAPSHOT/abdera2-client-2.0-SNAPSHOT.pom
[JENKINS] Archiving <https://builds.apache.org/job/Abdera2-trunk/ws/abdera2/client/target/abdera2-client-2.0-SNAPSHOT.jar>
to /home/hudson/hudson/jobs/Abdera2-trunk/modules/org.apache.abdera2$abdera2-client/builds/2011-09-26_21-10-06/archive/org.apache.abdera2/abdera2-client/2.0-SNAPSHOT/abdera2-client-2.0-SNAPSHOT.jar
ignoring exception during new ExecutedMojo null
[INFO] 
[INFO] --- maven-source-plugin:2.1.2:jar (attach-sources) @ abdera2-client ---
[INFO] META-INF already added, skipping
[INFO] META-INF/NOTICE already added, skipping
[INFO] META-INF/LICENSE already added, skipping
[INFO] Building jar: <https://builds.apache.org/job/Abdera2-trunk/ws/abdera2/client/target/abdera2-client-2.0-SNAPSHOT-sources.jar>
[INFO] META-INF already added, skipping
[INFO] META-INF/NOTICE already added, skipping
[INFO] META-INF/LICENSE already added, skipping
[INFO] [INFO] Installing <https://builds.apache.org/job/Abdera2-trunk/ws/abdera2/client/target/abdera2-client-2.0-SNAPSHOT.jar>
to /home/jenkins/.m2/repository/org/apache/abdera2/abdera2-client/2.0-SNAPSHOT/abdera2-client-2.0-SNAPSHOT.jar
[INFO] Installing <https://builds.apache.org/job/Abdera2-trunk/ws/abdera2/client/pom.xml>
to /home/jenkins/.m2/repository/org/apache/abdera2/abdera2-client/2.0-SNAPSHOT/abdera2-client-2.0-SNAPSHOT.pom

[INFO] --- maven-install-plugin:2.3.1:install (default-install) @ abdera2-client ---[INFO]
Installing <https://builds.apache.org/job/Abdera2-trunk/ws/abdera2/client/target/abdera2-client-2.0-SNAPSHOT-sources.jar>
to /home/jenkins/.m2/repository/org/apache/abdera2/abdera2-client/2.0-SNAPSHOT/abdera2-client-2.0-SNAPSHOT-sources.jar

[INFO] 
[INFO] --- maven-bundle-plugin:2.1.0:install (default-install) @ abdera2-client ---
[INFO] Installing org/apache/abdera2/abdera2-client/2.0-SNAPSHOT/abdera2-client-2.0-SNAPSHOT.jar
[INFO] Writing OBR metadata
[JENKINS] Archiving <https://builds.apache.org/job/Abdera2-trunk/ws/abdera2/client/target/abdera2-client-2.0-SNAPSHOT-sources.jar>
to /home/hudson/hudson/jobs/Abdera2-trunk/modules/org.apache.abdera2$abdera2-client/builds/2011-09-26_21-10-06/archive/org.apache.abdera2/abdera2-client/2.0-SNAPSHOT/abdera2-client-2.0-SNAPSHOT-sources.jar
[INFO] Downloading: http://repo1.maven.org/maven2/org/apache/maven/plugins/maven-install-plugin/maven-metadata.xml
                                                                        
[INFO] ------------------------------------------------------------------------
[INFO] Building Abdera2 Activities 2.0-SNAPSHOT
[INFO] ------------------------------------------------------------------------
Downloaded: http://repo1.maven.org/maven2/org/apache/maven/plugins/maven-install-plugin/maven-metadata.xml
(503 B at 1.4 KB/sec)
Downloading: http://repo1.maven.org/maven2/org/apache/maven/plugins/maven-resources-plugin/maven-metadata.xml
Downloaded: http://repo1.maven.org/maven2/org/apache/maven/plugins/maven-resources-plugin/maven-metadata.xml
(657 B at 1.3 KB/sec)
Downloading: http://repo1.maven.org/maven2/org/apache/maven/plugins/maven-deploy-plugin/maven-metadata.xml
Downloaded: http://repo1.maven.org/maven2/org/apache/maven/plugins/maven-deploy-plugin/maven-metadata.xml
(614 B at 1.2 KB/sec)
[INFO] 
[INFO] --- maven-clean-plugin:2.4.1:clean (default-clean) @ abdera2-activities ---
[INFO] 
[INFO] --- cobertura-maven-plugin:2.4:clean (default) @ abdera2-activities ---
[INFO] 
[INFO] --- maven-bundle-plugin:2.1.0:cleanVersions (default) @ abdera2-activities ---
[INFO] 
[INFO] --- maven-remote-resources-plugin:1.0:process (compile) @ abdera2-activities ---
[debug] execute contextualize
[INFO] [INFO] Using 'UTF-8' encoding to copy filtered resources.

[INFO] --- maven-resources-plugin:2.5:resources (default-resources) @ abdera2-activities ---
[INFO] Copying 0 resource
[INFO] Copying 2 resources
[INFO] 
[INFO] --- maven-compiler-plugin:2.3.2:compile (default-compile) @ abdera2-activities ---
[INFO] Compiling 92 source files to <https://builds.apache.org/job/Abdera2-trunk/ws/abdera2/activities/target/classes>
[INFO] -------------------------------------------------------------
[ERROR] COMPILATION ERROR : 
[INFO] -------------------------------------------------------------
[ERROR] <https://builds.apache.org/job/Abdera2-trunk/ws/abdera2/activities/src/main/java/org/apache/abdera2/activities/protocol/AbstractActivitiesWorkspaceProvider.java>:[83,24]
type parameters of <S>S cannot be determined; no unique maximal instance exists for
type variable S with upper bounds S,org.apache.abdera2.common.protocol.ResponseContext
[ERROR] <https://builds.apache.org/job/Abdera2-trunk/ws/abdera2/activities/src/main/java/org/apache/abdera2/activities/model/ASObject.java>:[296,22]
type parameters of <T>T cannot be determined; no unique maximal instance exists for
type variable T with upper bounds T,java.lang.Object
[ERROR] <https://builds.apache.org/job/Abdera2-trunk/ws/abdera2/activities/src/main/java/org/apache/abdera2/activities/model/IO.java>:[126,17]
type parameters of <T>T cannot be determined; no unique maximal instance exists for
type variable T with upper bounds T,org.apache.abdera2.activities.model.ASBase
[ERROR] <https://builds.apache.org/job/Abdera2-trunk/ws/abdera2/activities/src/main/java/org/apache/abdera2/activities/model/IO.java>:[147,23]
type parameters of <T>T cannot be determined; no unique maximal instance exists for
type variable T with upper bounds T,org.apache.abdera2.activities.model.ASObject
[ERROR] <https://builds.apache.org/job/Abdera2-trunk/ws/abdera2/activities/src/main/java/org/apache/abdera2/activities/extra/CreativeWork.java>:[19,22]
type parameters of <T>T cannot be determined; no unique maximal instance exists for
type variable T with upper bounds T,java.lang.Object
[ERROR] <https://builds.apache.org/job/Abdera2-trunk/ws/abdera2/activities/src/main/java/org/apache/abdera2/activities/extra/CreativeWork.java>:[27,22]
type parameters of <T>T cannot be determined; no unique maximal instance exists for
type variable T with upper bounds T,java.lang.Object
[ERROR] <https://builds.apache.org/job/Abdera2-trunk/ws/abdera2/activities/src/main/java/org/apache/abdera2/activities/extra/CreativeWork.java>:[35,22]
type parameters of <T>T cannot be determined; no unique maximal instance exists for
type variable T with upper bounds T,java.lang.Object
[ERROR] <https://builds.apache.org/job/Abdera2-trunk/ws/abdera2/activities/src/main/java/org/apache/abdera2/activities/extra/CreativeWork.java>:[43,22]
type parameters of <T>T cannot be determined; no unique maximal instance exists for
type variable T with upper bounds T,java.lang.Object
[ERROR] <https://builds.apache.org/job/Abdera2-trunk/ws/abdera2/activities/src/main/java/org/apache/abdera2/activities/extra/CreativeWork.java>:[51,22]
type parameters of <T>T cannot be determined; no unique maximal instance exists for
type variable T with upper bounds T,java.lang.Object
[ERROR] <https://builds.apache.org/job/Abdera2-trunk/ws/abdera2/activities/src/main/java/org/apache/abdera2/activities/extra/CreativeWork.java>:[59,22]
type parameters of <T>T cannot be determined; no unique maximal instance exists for
type variable T with upper bounds T,java.lang.Object
[ERROR] <https://builds.apache.org/job/Abdera2-trunk/ws/abdera2/activities/src/main/java/org/apache/abdera2/activities/extra/TvSeriesObject.java>:[32,22]
type parameters of <T>T cannot be determined; no unique maximal instance exists for
type variable T with upper bounds T,java.lang.Object
[ERROR] <https://builds.apache.org/job/Abdera2-trunk/ws/abdera2/activities/src/main/java/org/apache/abdera2/activities/extra/TvSeriesObject.java>:[40,22]
type parameters of <T>T cannot be determined; no unique maximal instance exists for
type variable T with upper bounds T,java.lang.Object
[ERROR] <https://builds.apache.org/job/Abdera2-trunk/ws/abdera2/activities/src/main/java/org/apache/abdera2/activities/extra/TvSeriesObject.java>:[48,22]
type parameters of <T>T cannot be determined; no unique maximal instance exists for
type variable T with upper bounds T,java.lang.Object
[ERROR] <https://builds.apache.org/job/Abdera2-trunk/ws/abdera2/activities/src/main/java/org/apache/abdera2/activities/extra/TvSeriesObject.java>:[56,22]
type parameters of <T>T cannot be determined; no unique maximal instance exists for
type variable T with upper bounds T,java.lang.Object
[ERROR] <https://builds.apache.org/job/Abdera2-trunk/ws/abdera2/activities/src/main/java/org/apache/abdera2/activities/extra/TvSeriesObject.java>:[64,22]
type parameters of <T>T cannot be determined; no unique maximal instance exists for
type variable T with upper bounds T,java.lang.Object
[ERROR] <https://builds.apache.org/job/Abdera2-trunk/ws/abdera2/activities/src/main/java/org/apache/abdera2/activities/extra/TvSeriesObject.java>:[96,22]
type parameters of <T>T cannot be determined; no unique maximal instance exists for
type variable T with upper bounds T,java.lang.Object
[ERROR] <https://builds.apache.org/job/Abdera2-trunk/ws/abdera2/activities/src/main/java/org/apache/abdera2/activities/extra/TvSeriesObject.java>:[104,22]
type parameters of <T>T cannot be determined; no unique maximal instance exists for
type variable T with upper bounds T,java.lang.Object
[ERROR] <https://builds.apache.org/job/Abdera2-trunk/ws/abdera2/activities/src/main/java/org/apache/abdera2/activities/extra/VersionObject.java>:[32,22]
type parameters of <T>T cannot be determined; no unique maximal instance exists for
type variable T with upper bounds T,java.lang.Object
[ERROR] <https://builds.apache.org/job/Abdera2-trunk/ws/abdera2/activities/src/main/java/org/apache/abdera2/activities/extra/OfferObject.java>:[30,22]
type parameters of <T>T cannot be determined; no unique maximal instance exists for
type variable T with upper bounds T,java.lang.Object
[ERROR] <https://builds.apache.org/job/Abdera2-trunk/ws/abdera2/activities/src/main/java/org/apache/abdera2/activities/extra/OfferObject.java>:[38,22]
type parameters of <T>T cannot be determined; no unique maximal instance exists for
type variable T with upper bounds T,java.lang.Object
[ERROR] <https://builds.apache.org/job/Abdera2-trunk/ws/abdera2/activities/src/main/java/org/apache/abdera2/activities/extra/OfferObject.java>:[46,22]
type parameters of <T>T cannot be determined; no unique maximal instance exists for
type variable T with upper bounds T,java.lang.Object
[ERROR] <https://builds.apache.org/job/Abdera2-trunk/ws/abdera2/activities/src/main/java/org/apache/abdera2/activities/extra/OfferObject.java>:[86,22]
type parameters of <T>T cannot be determined; no unique maximal instance exists for
type variable T with upper bounds T,java.lang.Object
[ERROR] <https://builds.apache.org/job/Abdera2-trunk/ws/abdera2/activities/src/main/java/org/apache/abdera2/activities/extra/BookObject.java>:[22,22]
type parameters of <T>T cannot be determined; no unique maximal instance exists for
type variable T with upper bounds T,java.lang.Object
[ERROR] <https://builds.apache.org/job/Abdera2-trunk/ws/abdera2/activities/src/main/java/org/apache/abdera2/activities/extra/BookObject.java>:[54,22]
type parameters of <T>T cannot be determined; no unique maximal instance exists for
type variable T with upper bounds T,java.lang.Object
[ERROR] <https://builds.apache.org/job/Abdera2-trunk/ws/abdera2/activities/src/main/java/org/apache/abdera2/activities/protocol/AbstractActivitiesProvider.java>:[88,24]
type parameters of <S>S cannot be determined; no unique maximal instance exists for
type variable S with upper bounds S,org.apache.abdera2.common.protocol.ResponseContext
[ERROR] <https://builds.apache.org/job/Abdera2-trunk/ws/abdera2/activities/src/main/java/org/apache/abdera2/activities/extra/ExtendedEventObject.java>:[17,22]
type parameters of <T>T cannot be determined; no unique maximal instance exists for
type variable T with upper bounds T,java.lang.Object
[ERROR] <https://builds.apache.org/job/Abdera2-trunk/ws/abdera2/activities/src/main/java/org/apache/abdera2/activities/extra/ExtendedEventObject.java>:[25,22]
type parameters of <T>T cannot be determined; no unique maximal instance exists for
type variable T with upper bounds T,java.lang.Object
[ERROR] <https://builds.apache.org/job/Abdera2-trunk/ws/abdera2/activities/src/main/java/org/apache/abdera2/activities/extra/ExtendedEventObject.java>:[33,22]
type parameters of <T>T cannot be determined; no unique maximal instance exists for
type variable T with upper bounds T,java.lang.Object
[ERROR] <https://builds.apache.org/job/Abdera2-trunk/ws/abdera2/activities/src/main/java/org/apache/abdera2/activities/extra/ExtendedEventObject.java>:[41,22]
type parameters of <T>T cannot be determined; no unique maximal instance exists for
type variable T with upper bounds T,java.lang.Object
[ERROR] <https://builds.apache.org/job/Abdera2-trunk/ws/abdera2/activities/src/main/java/org/apache/abdera2/activities/extra/ExtendedEventObject.java>:[49,22]
type parameters of <T>T cannot be determined; no unique maximal instance exists for
type variable T with upper bounds T,java.lang.Object
[ERROR] <https://builds.apache.org/job/Abdera2-trunk/ws/abdera2/activities/src/main/java/org/apache/abdera2/activities/protocol/basic/BasicAdapter.java>:[171,35]
type parameters of <S>S cannot be determined; no unique maximal instance exists for
type variable S with upper bounds S,org.apache.abdera2.common.protocol.ResponseContext
[ERROR] <https://builds.apache.org/job/Abdera2-trunk/ws/abdera2/activities/src/main/java/org/apache/abdera2/activities/protocol/basic/BasicAdapter.java>:[185,35]
type parameters of <S>S cannot be determined; no unique maximal instance exists for
type variable S with upper bounds S,org.apache.abdera2.common.protocol.ResponseContext
[ERROR] <https://builds.apache.org/job/Abdera2-trunk/ws/abdera2/activities/src/main/java/org/apache/abdera2/activities/extra/ASContext.java>:[30,27]
type parameters of <T>T cannot be determined; no unique maximal instance exists for
type variable T with upper bounds T,java.lang.Object
[ERROR] <https://builds.apache.org/job/Abdera2-trunk/ws/abdera2/activities/src/main/java/org/apache/abdera2/activities/extra/TvSeasonObject.java>:[32,22]
type parameters of <T>T cannot be determined; no unique maximal instance exists for
type variable T with upper bounds T,java.lang.Object
[ERROR] <https://builds.apache.org/job/Abdera2-trunk/ws/abdera2/activities/src/main/java/org/apache/abdera2/activities/extra/TvSeasonObject.java>:[40,22]
type parameters of <T>T cannot be determined; no unique maximal instance exists for
type variable T with upper bounds T,java.lang.Object
[ERROR] <https://builds.apache.org/job/Abdera2-trunk/ws/abdera2/activities/src/main/java/org/apache/abdera2/activities/extra/TvSeasonObject.java>:[48,22]
type parameters of <T>T cannot be determined; no unique maximal instance exists for
type variable T with upper bounds T,java.lang.Object
[ERROR] <https://builds.apache.org/job/Abdera2-trunk/ws/abdera2/activities/src/main/java/org/apache/abdera2/activities/extra/TvSeasonObject.java>:[56,22]
type parameters of <T>T cannot be determined; no unique maximal instance exists for
type variable T with upper bounds T,java.lang.Object
[ERROR] <https://builds.apache.org/job/Abdera2-trunk/ws/abdera2/activities/src/main/java/org/apache/abdera2/activities/extra/TvSeasonObject.java>:[64,22]
type parameters of <T>T cannot be determined; no unique maximal instance exists for
type variable T with upper bounds T,java.lang.Object
[ERROR] <https://builds.apache.org/job/Abdera2-trunk/ws/abdera2/activities/src/main/java/org/apache/abdera2/activities/extra/TvSeasonObject.java>:[96,22]
type parameters of <T>T cannot be determined; no unique maximal instance exists for
type variable T with upper bounds T,java.lang.Object
[ERROR] <https://builds.apache.org/job/Abdera2-trunk/ws/abdera2/activities/src/main/java/org/apache/abdera2/activities/extra/TvSeasonObject.java>:[104,22]
type parameters of <T>T cannot be determined; no unique maximal instance exists for
type variable T with upper bounds T,java.lang.Object
[JENKINS] Archiving <https://builds.apache.org/job/Abdera2-trunk/ws/abdera2/activities/pom.xml>
to /home/hudson/hudson/jobs/Abdera2-trunk/modules/org.apache.abdera2$abdera2-activities/builds/2011-09-26_21-10-06/archive/org.apache.abdera2/abdera2-activities/2.0-SNAPSHOT/abdera2-activities-2.0-SNAPSHOT.pom[ERROR]
<https://builds.apache.org/job/Abdera2-trunk/ws/abdera2/activities/src/main/java/org/apache/abdera2/activities/extra/TvEpisodeObject.java>:[28,22]
type parameters of <T>T cannot be determined; no unique maximal instance exists for
type variable T with upper bounds T,java.lang.Object
[ERROR] <https://builds.apache.org/job/Abdera2-trunk/ws/abdera2/activities/src/main/java/org/apache/abdera2/activities/extra/TvEpisodeObject.java>:[36,22]
type parameters of <T>T cannot be determined; no unique maximal instance exists for
type variable T with upper bounds T,java.lang.Object
[ERROR] <https://builds.apache.org/job/Abdera2-trunk/ws/abdera2/activities/src/main/java/org/apache/abdera2/activities/extra/TvEpisodeObject.java>:[44,22]
type parameters of <T>T cannot be determined; no unique maximal instance exists for
type variable T with upper bounds T,java.lang.Object
[ERROR] <https://builds.apache.org/job/Abdera2-trunk/ws/abdera2/activities/src/main/java/org/apache/abdera2/activities/extra/TvEpisodeObject.java>:[52,22]
type parameters of <T>T cannot be determined; no unique maximal instance exists for
type variable T with upper bounds T,java.lang.Object
[ERROR] <https://builds.apache.org/job/Abdera2-trunk/ws/abdera2/activities/src/main/java/org/apache/abdera2/activities/extra/TvEpisodeObject.java>:[60,22]
type parameters of <T>T cannot be determined; no unique maximal instance exists for
type variable T with upper bounds T,java.lang.Object
[ERROR] <https://builds.apache.org/job/Abdera2-trunk/ws/abdera2/activities/src/main/java/org/apache/abdera2/activities/extra/TvEpisodeObject.java>:[76,22]
type parameters of <T>T cannot be determined; no unique maximal instance exists for
type variable T with upper bounds T,java.lang.Object
[ERROR] <https://builds.apache.org/job/Abdera2-trunk/ws/abdera2/activities/src/main/java/org/apache/abdera2/activities/extra/TvEpisodeObject.java>:[84,22]
type parameters of <T>T cannot be determined; no unique maximal instance exists for
type variable T with upper bounds T,java.lang.Object
[ERROR] <https://builds.apache.org/job/Abdera2-trunk/ws/abdera2/activities/src/main/java/org/apache/abdera2/activities/extra/MovieObject.java>:[30,22]
type parameters of <T>T cannot be determined; no unique maximal instance exists for
type variable T with upper bounds T,java.lang.Object

[ERROR] <https://builds.apache.org/job/Abdera2-trunk/ws/abdera2/activities/src/main/java/org/apache/abdera2/activities/extra/MovieObject.java>:[38,22]
type parameters of <T>T cannot be determined; no unique maximal instance exists for
type variable T with upper bounds T,java.lang.Object
[ERROR] <https://builds.apache.org/job/Abdera2-trunk/ws/abdera2/activities/src/main/java/org/apache/abdera2/activities/extra/MovieObject.java>:[54,22]
type parameters of <T>T cannot be determined; no unique maximal instance exists for
type variable T with upper bounds T,java.lang.Object
[ERROR] <https://builds.apache.org/job/Abdera2-trunk/ws/abdera2/activities/src/main/java/org/apache/abdera2/activities/extra/MovieObject.java>:[62,22]
type parameters of <T>T cannot be determined; no unique maximal instance exists for
type variable T with upper bounds T,java.lang.Object
[ERROR] <https://builds.apache.org/job/Abdera2-trunk/ws/abdera2/activities/src/main/java/org/apache/abdera2/activities/extra/MovieObject.java>:[70,22]
type parameters of <T>T cannot be determined; no unique maximal instance exists for
type variable T with upper bounds T,java.lang.Object
[INFO] 52 errors 
[INFO] -------------------------------------------------------------
[INFO] ------------------------------------------------------------------------
[INFO] Reactor Summary:
[INFO] 
[INFO] Apache Abdera2 .................................... SUCCESS [10.466s]
[INFO] Abdera2 Common Library ............................ SUCCESS [16.874s]
[INFO] Abdera2 Core ...................................... SUCCESS [13.267s]
[INFO] Abdera2 Server .................................... SUCCESS [5.591s]
[INFO] Abdera2 Client .................................... SUCCESS [9.749s]
[INFO] Abdera2 Activities ................................ FAILURE [2.914s]
[INFO] Abdera2 Extensions ................................ SKIPPED
[INFO] Abdera2 Security .................................. SKIPPED
[INFO] Abdera2 Tests ..................................... SKIPPED
[INFO] ------------------------------------------------------------------------
[INFO] BUILD FAILURE
[INFO] ------------------------------------------------------------------------
[INFO] Total time: 1:02.234s
[INFO] Finished at: Mon Sep 26 21:11:12 UTC 2011
[INFO] Final Memory: 32M/725M
[INFO] ------------------------------------------------------------------------
Waiting for Jenkins to finish collecting data
mavenExecutionResult exceptions not empty
message : Failed to execute goal org.apache.maven.plugins:maven-compiler-plugin:2.3.2:compile
(default-compile) on project abdera2-activities: Compilation failure
cause : Compilation failure
Stack trace : 
org.apache.maven.lifecycle.LifecycleExecutionException: Failed to execute goal org.apache.maven.plugins:maven-compiler-plugin:2.3.2:compile
(default-compile) on project abdera2-activities: Compilation failure
	at org.apache.maven.lifecycle.internal.MojoExecutor.execute(MojoExecutor.java:213)
	at org.apache.maven.lifecycle.internal.MojoExecutor.execute(MojoExecutor.java:153)
	at org.apache.maven.lifecycle.internal.MojoExecutor.execute(MojoExecutor.java:145)
	at org.apache.maven.lifecycle.internal.LifecycleModuleBuilder.buildProject(LifecycleModuleBuilder.java:84)
	at org.apache.maven.lifecycle.internal.LifecycleModuleBuilder.buildProject(LifecycleModuleBuilder.java:59)
	at org.apache.maven.lifecycle.internal.LifecycleStarter.singleThreadedBuild(LifecycleStarter.java:183)
	at org.apache.maven.lifecycle.internal.LifecycleStarter.execute(LifecycleStarter.java:161)
	at org.apache.maven.DefaultMaven.doExecute(DefaultMaven.java:319)
	at org.apache.maven.DefaultMaven.execute(DefaultMaven.java:156)
	at org.jvnet.hudson.maven3.launcher.Maven3Launcher.main(Maven3Launcher.java:79)
	at sun.reflect.NativeMethodAccessorImpl.invoke0(Native Method)
	at sun.reflect.NativeMethodAccessorImpl.invoke(NativeMethodAccessorImpl.java:39)
	at sun.reflect.DelegatingMethodAccessorImpl.invoke(DelegatingMethodAccessorImpl.java:25)
	at java.lang.reflect.Method.invoke(Method.java:597)
	at org.codehaus.plexus.classworlds.launcher.Launcher.launchStandard(Launcher.java:329)
	at org.codehaus.plexus.classworlds.launcher.Launcher.launch(Launcher.java:239)
	at org.jvnet.hudson.maven3.agent.Maven3Main.launch(Maven3Main.java:158)
	at hudson.maven.Maven3Builder.call(Maven3Builder.java:122)
	at hudson.maven.Maven3Builder.call(Maven3Builder.java:74)
	at hudson.remoting.UserRequest.perform(UserRequest.java:118)
	at hudson.remoting.UserRequest.perform(UserRequest.java:48)
	at hudson.remoting.Request$2.run(Request.java:287)
	at java.util.concurrent.Executors$RunnableAdapter.call(Executors.java:441)
	at java.util.concurrent.FutureTask$Sync.innerRun(FutureTask.java:303)
	at java.util.concurrent.FutureTask.run(FutureTask.java:138)
	at java.util.concurrent.ThreadPoolExecutor$Worker.runTask(ThreadPoolExecutor.java:886)
	at java.util.concurrent.ThreadPoolExecutor$Worker.run(ThreadPoolExecutor.java:908)
	at java.lang.Thread.run(Thread.java:619)
Caused by: org.apache.maven.plugin.CompilationFailureException: Compilation failure
	at org.apache.maven.plugin.AbstractCompilerMojo.execute(AbstractCompilerMojo.java:656)
	at org.apache.maven.plugin.CompilerMojo.execute(CompilerMojo.java:128)
	at org.apache.maven.plugin.DefaultBuildPluginManager.executeMojo(DefaultBuildPluginManager.java:107)
	at org.apache.maven.lifecycle.internal.MojoExecutor.execute(MojoExecutor.java:209)
	... 27 more
Sending e-mails to: dev@abdera.apache.org
Sending e-mails to: dev@abdera.apache.org
channel stopped


Mime
View raw message