abdera-dev mailing list archives

Site index · List index
Message view « Date » · « Thread »
Top « Date » · « Thread »
From Apache Jenkins Server <jenk...@builds.apache.org>
Subject Build failed in Jenkins: Abdera2-trunk #1
Date Sun, 25 Sep 2011 17:31:08 GMT
See <https://builds.apache.org/job/Abdera2-trunk/1/>

------------------------------------------
[...truncated 1195 lines...]
	at org.jvnet.hudson.maven3.launcher.Maven3Launcher.main(Maven3Launcher.java:79)
	at sun.reflect.NativeMethodAccessorImpl.invoke0(Native Method)
	at sun.reflect.NativeMethodAccessorImpl.invoke(NativeMethodAccessorImpl.java:39)
	at sun.reflect.DelegatingMethodAccessorImpl.invoke(DelegatingMethodAccessorImpl.java:25)
	at java.lang.reflect.Method.invoke(Method.java:597)
	at org.codehaus.plexus.classworlds.launcher.Launcher.launchStandard(Launcher.java:329)
	at org.codehaus.plexus.classworlds.launcher.Launcher.launch(Launcher.java:239)
	at org.jvnet.hudson.maven3.agent.Maven3Main.launch(Maven3Main.java:158)
	at hudson.maven.Maven3Builder.call(Maven3Builder.java:122)
	at hudson.maven.Maven3Builder.call(Maven3Builder.java:74)
	at hudson.remoting.UserRequest.perform(UserRequest.java:118)
	at hudson.remoting.UserRequest.perform(UserRequest.java:48)
	at hudson.remoting.Request$2.run(Request.java:287)
	at java.util.concurrent.Executors$RunnableAdapter.call(Executors.java:441)
	at java.util.concurrent.FutureTask$Sync.innerRun(FutureTask.java:303)
	at java.util.concurrent.FutureTask.run(FutureTask.java:138)
	at java.util.concurrent.ThreadPoolExecutor$Worker.runTask(ThreadPoolExecutor.java:886)
	at java.util.concurrent.ThreadPoolExecutor$Worker.run(ThreadPoolExecutor.java:908)
	at java.lang.Thread.run(Thread.java:662)
Caused by: org.apache.maven.plugin.CompilationFailureException: Compilation failure
<https://builds.apache.org/job/Abdera2-trunk/ws/abdera2/common/src/main/java/org/apache/abdera2/common/protocol/AbstractResponseContext.java>:[185,31]
type parameters of <T>T cannot be determined; no unique maximal instance exists for
type variable T with upper bounds T,org.apache.abdera2.common.protocol.ResponseContext

	at org.apache.maven.plugin.AbstractCompilerMojo.execute(AbstractCompilerMojo.java:656)
	at org.apache.maven.plugin.CompilerMojo.execute(CompilerMojo.java:128)
	at org.apache.maven.plugin.DefaultBuildPluginManager.executeMojo(DefaultBuildPluginManager.java:101)
	at org.apache.maven.lifecycle.internal.MojoExecutor.execute(MojoExecutor.java:209)
	... 27 more
Sending e-mails to: dev@abdera.apache.org
channel stopped
[abdera2] $ /home/hudson/tools/maven/latest3/bin/mvn -f <https://builds.apache.org/job/Abdera2-trunk/ws/abdera2/pom.xml>
-e -B sonar:sonar -Dsonar.jdbc.driver=org.postgresql.Driver -Dsonar.jdbc.url=jdbc:postgresql://sonar.zitting.name/sonar
******** ******** -Dsonar.host.url=http://sonar.zitting.name/
[INFO] Error stacktraces are turned on.
[INFO] Scanning for projects...
[INFO] ------------------------------------------------------------------------
[INFO] Reactor Build Order:
[INFO] 
[INFO] Apache Abdera2
[INFO] Abdera2 Common Library
[INFO] Abdera2 Core
[INFO] Abdera2 Server
[INFO] Abdera2 Client
[INFO] Abdera2 Activities
[INFO] Abdera2 Extensions
[INFO] Abdera2 Security
[INFO] Abdera2 Tests
Downloading: http://repo1.maven.org/maven2/org/codehaus/mojo/sonar-maven-plugin/maven-metadata.xml
Downloaded: http://repo1.maven.org/maven2/org/codehaus/mojo/sonar-maven-plugin/maven-metadata.xml
(465 B at 1.0 KB/sec)
Downloading: http://repo1.maven.org/maven2/org/codehaus/mojo/sonar-maven-plugin/2.0-beta-2/sonar-maven-plugin-2.0-beta-2.pom
Downloaded: http://repo1.maven.org/maven2/org/codehaus/mojo/sonar-maven-plugin/2.0-beta-2/sonar-maven-plugin-2.0-beta-2.pom
(6 KB at 20.6 KB/sec)
Downloading: http://repo1.maven.org/maven2/org/codehaus/mojo/sonar-maven-plugin/2.0-beta-2/sonar-maven-plugin-2.0-beta-2.jar
Downloaded: http://repo1.maven.org/maven2/org/codehaus/mojo/sonar-maven-plugin/2.0-beta-2/sonar-maven-plugin-2.0-beta-2.jar
(15 KB at 36.0 KB/sec)
[INFO]                                                                         
[INFO] ------------------------------------------------------------------------
[INFO] Building Apache Abdera2 2.0-SNAPSHOT
[INFO] ------------------------------------------------------------------------
Downloading: http://download.java.net/maven/2/org/apache/abdera2/abdera2-common/2.0-SNAPSHOT/maven-metadata.xml
Downloading: http://download.java.net/maven/2/org/apache/ws/commons/axiom/axiom-impl/1.2.12/axiom-impl-1.2.12.pom
Downloading: http://repo1.maven.org/maven2/org/apache/ws/commons/axiom/axiom-impl/1.2.12/axiom-impl-1.2.12.pom
Downloaded: http://repo1.maven.org/maven2/org/apache/ws/commons/axiom/axiom-impl/1.2.12/axiom-impl-1.2.12.pom
(6 KB at 22.9 KB/sec)
Downloading: http://download.java.net/maven/2/org/apache/ws/commons/axiom/axiom-parent/1.2.12/axiom-parent-1.2.12.pom
Downloading: http://repo1.maven.org/maven2/org/apache/ws/commons/axiom/axiom-parent/1.2.12/axiom-parent-1.2.12.pom
Downloaded: http://repo1.maven.org/maven2/org/apache/ws/commons/axiom/axiom-parent/1.2.12/axiom-parent-1.2.12.pom
(18 KB at 68.7 KB/sec)
Downloading: http://download.java.net/maven/2/org/apache/ws/commons/axiom/axiom-api/1.2.12/axiom-api-1.2.12.pom
Downloading: http://repo1.maven.org/maven2/org/apache/ws/commons/axiom/axiom-api/1.2.12/axiom-api-1.2.12.pom
Downloaded: http://repo1.maven.org/maven2/org/apache/ws/commons/axiom/axiom-api/1.2.12/axiom-api-1.2.12.pom
(16 KB at 58.3 KB/sec)
Downloading: http://download.java.net/maven/2/org/apache/abdera2/abdera2-common/2.0-SNAPSHOT/abdera2-common-2.0-SNAPSHOT.jar
Downloading: http://download.java.net/maven/2/org/apache/ws/commons/axiom/axiom-impl/1.2.12/axiom-impl-1.2.12.jar
Downloading: http://download.java.net/maven/2/org/apache/ws/commons/axiom/axiom-api/1.2.12/axiom-api-1.2.12.jar
Downloading: http://repo1.maven.org/maven2/org/apache/ws/commons/axiom/axiom-impl/1.2.12/axiom-impl-1.2.12.jar
Downloading: http://repo1.maven.org/maven2/org/apache/ws/commons/axiom/axiom-api/1.2.12/axiom-api-1.2.12.jar
Downloaded: http://repo1.maven.org/maven2/org/apache/ws/commons/axiom/axiom-impl/1.2.12/axiom-impl-1.2.12.jar
(120 KB at 235.0 KB/sec)
Downloaded: http://repo1.maven.org/maven2/org/apache/ws/commons/axiom/axiom-api/1.2.12/axiom-api-1.2.12.jar
(421 KB at 553.2 KB/sec)
[WARNING] The following dependencies could not be resolved at this point of the build but
seem to be part of the reactor:
[WARNING] o org.apache.abdera2:abdera2-common:jar:2.0-SNAPSHOT (compile)
[WARNING] Try running the build up to the lifecycle phase "package"
Downloading: http://download.java.net/maven/2/org/apache/abdera2/abdera2-core/2.0-SNAPSHOT/maven-metadata.xml
Downloading: http://download.java.net/maven/2/org/apache/abdera2/abdera2-core/2.0-SNAPSHOT/abdera2-core-2.0-SNAPSHOT.jar
[WARNING] The following dependencies could not be resolved at this point of the build but
seem to be part of the reactor:
[WARNING] o org.apache.abdera2:abdera2-core:jar:2.0-SNAPSHOT (compile)
[WARNING] o org.apache.abdera2:abdera2-common:jar:2.0-SNAPSHOT (compile)
[WARNING] Try running the build up to the lifecycle phase "package"
Downloading: http://download.java.net/maven/2/org/apache/httpcomponents/httpmime/4.1.2/httpmime-4.1.2.pom
Downloading: http://repo1.maven.org/maven2/org/apache/httpcomponents/httpmime/4.1.2/httpmime-4.1.2.pom
Downloaded: http://repo1.maven.org/maven2/org/apache/httpcomponents/httpmime/4.1.2/httpmime-4.1.2.pom
(6 KB at 20.2 KB/sec)
Downloading: http://download.java.net/maven/2/org/apache/httpcomponents/httpclient-cache/4.1.2/httpclient-cache-4.1.2.pom
Downloading: http://repo1.maven.org/maven2/org/apache/httpcomponents/httpclient-cache/4.1.2/httpclient-cache-4.1.2.pom
Downloaded: http://repo1.maven.org/maven2/org/apache/httpcomponents/httpclient-cache/4.1.2/httpclient-cache-4.1.2.pom
(7 KB at 25.0 KB/sec)
Downloading: http://download.java.net/maven/2/org/apache/httpcomponents/httpmime/4.1.2/httpmime-4.1.2.jar
Downloading: http://download.java.net/maven/2/org/apache/httpcomponents/httpclient-cache/4.1.2/httpclient-cache-4.1.2.jar
Downloading: http://repo1.maven.org/maven2/org/apache/httpcomponents/httpmime/4.1.2/httpmime-4.1.2.jar
Downloading: http://repo1.maven.org/maven2/org/apache/httpcomponents/httpclient-cache/4.1.2/httpclient-cache-4.1.2.jar
Downloaded: http://repo1.maven.org/maven2/org/apache/httpcomponents/httpmime/4.1.2/httpmime-4.1.2.jar
(27 KB at 51.5 KB/sec)
Downloaded: http://repo1.maven.org/maven2/org/apache/httpcomponents/httpclient-cache/4.1.2/httpclient-cache-4.1.2.jar
(104 KB at 136.1 KB/sec)
[WARNING] The following dependencies could not be resolved at this point of the build but
seem to be part of the reactor:
[WARNING] o org.apache.abdera2:abdera2-core:jar:2.0-SNAPSHOT (compile)
[WARNING] o org.apache.abdera2:abdera2-common:jar:2.0-SNAPSHOT (compile)
[WARNING] Try running the build up to the lifecycle phase "package"
Downloading: http://download.java.net/maven/2/org/apache/abdera2/abdera2-client/2.0-SNAPSHOT/maven-metadata.xml
Downloading: http://download.java.net/maven/2/org/apache/abdera2/abdera2-client/2.0-SNAPSHOT/abdera2-client-2.0-SNAPSHOT.jar
[WARNING] The following dependencies could not be resolved at this point of the build but
seem to be part of the reactor:
[WARNING] o org.apache.abdera2:abdera2-common:jar:2.0-SNAPSHOT (compile)
[WARNING] o org.apache.abdera2:abdera2-client:jar:2.0-SNAPSHOT (compile)
[WARNING] o org.apache.abdera2:abdera2-core:jar:2.0-SNAPSHOT (compile)
[WARNING] Try running the build up to the lifecycle phase "package"
Downloading: http://download.java.net/maven/2/org/apache/abdera2/abdera2-server/2.0-SNAPSHOT/maven-metadata.xml
Downloading: http://download.java.net/maven/2/org/apache/abdera2/abdera2-activities/2.0-SNAPSHOT/maven-metadata.xml
Downloading: http://download.java.net/maven/2/org/apache/abdera2/abdera2-server/2.0-SNAPSHOT/abdera2-server-2.0-SNAPSHOT.jar
Downloading: http://download.java.net/maven/2/org/apache/abdera2/abdera2-activities/2.0-SNAPSHOT/abdera2-activities-2.0-SNAPSHOT.jar
[WARNING] The following dependencies could not be resolved at this point of the build but
seem to be part of the reactor:
[WARNING] o org.apache.abdera2:abdera2-core:jar:2.0-SNAPSHOT (compile)
[WARNING] o org.apache.abdera2:abdera2-common:jar:2.0-SNAPSHOT (compile)
[WARNING] o org.apache.abdera2:abdera2-server:jar:2.0-SNAPSHOT (compile)
[WARNING] o org.apache.abdera2:abdera2-client:jar:2.0-SNAPSHOT (compile)
[WARNING] o org.apache.abdera2:abdera2-activities:jar:2.0-SNAPSHOT (compile)
[WARNING] Try running the build up to the lifecycle phase "package"
Downloading: http://download.java.net/maven/2/org/apache/santuario/xmlsec/1.4.5/xmlsec-1.4.5.pom
Downloading: http://repo1.maven.org/maven2/org/apache/santuario/xmlsec/1.4.5/xmlsec-1.4.5.pom
Downloaded: http://repo1.maven.org/maven2/org/apache/santuario/xmlsec/1.4.5/xmlsec-1.4.5.pom
(12 KB at 23.2 KB/sec)
Downloading: http://download.java.net/maven/2/org/apache/santuario/xmlsec/1.4.5/xmlsec-1.4.5.jar
Downloading: http://repo1.maven.org/maven2/org/apache/santuario/xmlsec/1.4.5/xmlsec-1.4.5.jar
Downloaded: http://repo1.maven.org/maven2/org/apache/santuario/xmlsec/1.4.5/xmlsec-1.4.5.jar
(441 KB at 866.9 KB/sec)
[WARNING] The following dependencies could not be resolved at this point of the build but
seem to be part of the reactor:
[WARNING] o org.apache.abdera2:abdera2-core:jar:2.0-SNAPSHOT (compile)
[WARNING] o org.apache.abdera2:abdera2-common:jar:2.0-SNAPSHOT (compile)
[WARNING] o org.apache.abdera2:abdera2-server:jar:2.0-SNAPSHOT (compile)
[WARNING] Try running the build up to the lifecycle phase "package"
Downloading: http://download.java.net/maven/2/org/apache/abdera2/abdera2-security/2.0-SNAPSHOT/maven-metadata.xml
Downloading: http://download.java.net/maven/2/org/apache/abdera2/abdera2-ext/2.0-SNAPSHOT/maven-metadata.xml
Downloading: http://download.java.net/maven/2/org/eclipse/jetty/jetty-server/8.0.0.v20110901/jetty-server-8.0.0.v20110901.pom
Downloading: http://repo1.maven.org/maven2/org/eclipse/jetty/jetty-server/8.0.0.v20110901/jetty-server-8.0.0.v20110901.pom
Downloaded: http://repo1.maven.org/maven2/org/eclipse/jetty/jetty-server/8.0.0.v20110901/jetty-server-8.0.0.v20110901.pom
(4 KB at 13.4 KB/sec)
Downloading: http://download.java.net/maven/2/org/eclipse/jetty/jetty-project/8.0.0.v20110901/jetty-project-8.0.0.v20110901.pom
Downloading: http://repo1.maven.org/maven2/org/eclipse/jetty/jetty-project/8.0.0.v20110901/jetty-project-8.0.0.v20110901.pom
Downloaded: http://repo1.maven.org/maven2/org/eclipse/jetty/jetty-project/8.0.0.v20110901/jetty-project-8.0.0.v20110901.pom
(22 KB at 81.2 KB/sec)
Downloading: http://download.java.net/maven/2/org/eclipse/jetty/jetty-parent/18/jetty-parent-18.pom
Downloading: http://repo1.maven.org/maven2/org/eclipse/jetty/jetty-parent/18/jetty-parent-18.pom
Downloaded: http://repo1.maven.org/maven2/org/eclipse/jetty/jetty-parent/18/jetty-parent-18.pom
(17 KB at 62.2 KB/sec)
Downloading: http://download.java.net/maven/2/org/mortbay/jetty/servlet-api/3.0.20100224/servlet-api-3.0.20100224.pom
Downloading: http://repo1.maven.org/maven2/org/mortbay/jetty/servlet-api/3.0.20100224/servlet-api-3.0.20100224.pom
Downloaded: http://repo1.maven.org/maven2/org/mortbay/jetty/servlet-api/3.0.20100224/servlet-api-3.0.20100224.pom
(3 KB at 9.6 KB/sec)
Downloading: http://download.java.net/maven/2/org/eclipse/jetty/jetty-continuation/8.0.0.v20110901/jetty-continuation-8.0.0.v20110901.pom
Downloading: http://repo1.maven.org/maven2/org/eclipse/jetty/jetty-continuation/8.0.0.v20110901/jetty-continuation-8.0.0.v20110901.pom
Downloaded: http://repo1.maven.org/maven2/org/eclipse/jetty/jetty-continuation/8.0.0.v20110901/jetty-continuation-8.0.0.v20110901.pom
(3 KB at 10.2 KB/sec)
Downloading: http://download.java.net/maven/2/org/eclipse/jetty/jetty-http/8.0.0.v20110901/jetty-http-8.0.0.v20110901.pom
Downloading: http://repo1.maven.org/maven2/org/eclipse/jetty/jetty-http/8.0.0.v20110901/jetty-http-8.0.0.v20110901.pom
Downloaded: http://repo1.maven.org/maven2/org/eclipse/jetty/jetty-http/8.0.0.v20110901/jetty-http-8.0.0.v20110901.pom
(3 KB at 10.1 KB/sec)
Downloading: http://download.java.net/maven/2/org/eclipse/jetty/jetty-io/8.0.0.v20110901/jetty-io-8.0.0.v20110901.pom
Downloading: http://repo1.maven.org/maven2/org/eclipse/jetty/jetty-io/8.0.0.v20110901/jetty-io-8.0.0.v20110901.pom
Downloaded: http://repo1.maven.org/maven2/org/eclipse/jetty/jetty-io/8.0.0.v20110901/jetty-io-8.0.0.v20110901.pom
(3 KB at 8.0 KB/sec)
Downloading: http://download.java.net/maven/2/org/eclipse/jetty/jetty-util/8.0.0.v20110901/jetty-util-8.0.0.v20110901.pom
Downloading: http://repo1.maven.org/maven2/org/eclipse/jetty/jetty-util/8.0.0.v20110901/jetty-util-8.0.0.v20110901.pom
Downloaded: http://repo1.maven.org/maven2/org/eclipse/jetty/jetty-util/8.0.0.v20110901/jetty-util-8.0.0.v20110901.pom
(4 KB at 10.9 KB/sec)
Downloading: http://download.java.net/maven/2/org/eclipse/jetty/jetty-servlet/8.0.0.v20110901/jetty-servlet-8.0.0.v20110901.pom
Downloading: http://repo1.maven.org/maven2/org/eclipse/jetty/jetty-servlet/8.0.0.v20110901/jetty-servlet-8.0.0.v20110901.pom
Downloaded: http://repo1.maven.org/maven2/org/eclipse/jetty/jetty-servlet/8.0.0.v20110901/jetty-servlet-8.0.0.v20110901.pom
(3 KB at 9.9 KB/sec)
Downloading: http://download.java.net/maven/2/org/eclipse/jetty/jetty-security/8.0.0.v20110901/jetty-security-8.0.0.v20110901.pom
Downloading: http://repo1.maven.org/maven2/org/eclipse/jetty/jetty-security/8.0.0.v20110901/jetty-security-8.0.0.v20110901.pom
Downloaded: http://repo1.maven.org/maven2/org/eclipse/jetty/jetty-security/8.0.0.v20110901/jetty-security-8.0.0.v20110901.pom
(3 KB at 9.5 KB/sec)
Downloading: http://download.java.net/maven/2/org/apache/abdera2/abdera2-security/2.0-SNAPSHOT/abdera2-security-2.0-SNAPSHOT.jar
Downloading: http://download.java.net/maven/2/org/apache/abdera2/abdera2-ext/2.0-SNAPSHOT/abdera2-ext-2.0-SNAPSHOT.jar
Downloading: http://download.java.net/maven/2/org/eclipse/jetty/jetty-server/8.0.0.v20110901/jetty-server-8.0.0.v20110901.jar
Downloading: http://download.java.net/maven/2/org/mortbay/jetty/servlet-api/3.0.20100224/servlet-api-3.0.20100224.jar
Downloading: http://download.java.net/maven/2/org/eclipse/jetty/jetty-continuation/8.0.0.v20110901/jetty-continuation-8.0.0.v20110901.jar
Downloading: http://download.java.net/maven/2/org/eclipse/jetty/jetty-http/8.0.0.v20110901/jetty-http-8.0.0.v20110901.jar
Downloading: http://download.java.net/maven/2/org/eclipse/jetty/jetty-io/8.0.0.v20110901/jetty-io-8.0.0.v20110901.jar
Downloading: http://download.java.net/maven/2/org/eclipse/jetty/jetty-util/8.0.0.v20110901/jetty-util-8.0.0.v20110901.jar
Downloading: http://download.java.net/maven/2/org/eclipse/jetty/jetty-security/8.0.0.v20110901/jetty-security-8.0.0.v20110901.jar
Downloading: http://download.java.net/maven/2/org/eclipse/jetty/jetty-servlet/8.0.0.v20110901/jetty-servlet-8.0.0.v20110901.jar
Downloading: http://repo1.maven.org/maven2/org/mortbay/jetty/servlet-api/3.0.20100224/servlet-api-3.0.20100224.jar
Downloading: http://repo1.maven.org/maven2/org/eclipse/jetty/jetty-server/8.0.0.v20110901/jetty-server-8.0.0.v20110901.jar
Downloading: http://repo1.maven.org/maven2/org/eclipse/jetty/jetty-http/8.0.0.v20110901/jetty-http-8.0.0.v20110901.jar
Downloading: http://repo1.maven.org/maven2/org/eclipse/jetty/jetty-continuation/8.0.0.v20110901/jetty-continuation-8.0.0.v20110901.jar
Downloading: http://repo1.maven.org/maven2/org/eclipse/jetty/jetty-io/8.0.0.v20110901/jetty-io-8.0.0.v20110901.jar
Downloaded: http://repo1.maven.org/maven2/org/mortbay/jetty/servlet-api/3.0.20100224/servlet-api-3.0.20100224.jar
(206 KB at 158.6 KB/sec)
Downloading: http://repo1.maven.org/maven2/org/eclipse/jetty/jetty-util/8.0.0.v20110901/jetty-util-8.0.0.v20110901.jar
Downloaded: http://repo1.maven.org/maven2/org/eclipse/jetty/jetty-continuation/8.0.0.v20110901/jetty-continuation-8.0.0.v20110901.jar
(21 KB at 13.7 KB/sec)
Downloading: http://repo1.maven.org/maven2/org/eclipse/jetty/jetty-servlet/8.0.0.v20110901/jetty-servlet-8.0.0.v20110901.jar
Downloaded: http://repo1.maven.org/maven2/org/eclipse/jetty/jetty-http/8.0.0.v20110901/jetty-http-8.0.0.v20110901.jar
(115 KB at 64.6 KB/sec)
Downloading: http://repo1.maven.org/maven2/org/eclipse/jetty/jetty-security/8.0.0.v20110901/jetty-security-8.0.0.v20110901.jar
Downloaded: http://repo1.maven.org/maven2/org/eclipse/jetty/jetty-server/8.0.0.v20110901/jetty-server-8.0.0.v20110901.jar
(317 KB at 157.5 KB/sec)
Downloaded: http://repo1.maven.org/maven2/org/eclipse/jetty/jetty-io/8.0.0.v20110901/jetty-io-8.0.0.v20110901.jar
(96 KB at 42.3 KB/sec)
Downloaded: http://repo1.maven.org/maven2/org/eclipse/jetty/jetty-servlet/8.0.0.v20110901/jetty-servlet-8.0.0.v20110901.jar
(89 KB at 50.6 KB/sec)
Downloaded: http://repo1.maven.org/maven2/org/eclipse/jetty/jetty-util/8.0.0.v20110901/jetty-util-8.0.0.v20110901.jar
(227 KB at 102.1 KB/sec)
Downloaded: http://repo1.maven.org/maven2/org/eclipse/jetty/jetty-security/8.0.0.v20110901/jetty-security-8.0.0.v20110901.jar
(86 KB at 42.6 KB/sec)
[WARNING] The following dependencies could not be resolved at this point of the build but
seem to be part of the reactor:
[WARNING] o org.apache.abdera2:abdera2-core:jar:2.0-SNAPSHOT (compile)
[WARNING] o org.apache.abdera2:abdera2-common:jar:2.0-SNAPSHOT (compile)
[WARNING] o org.apache.abdera2:abdera2-server:jar:2.0-SNAPSHOT (compile)
[WARNING] o org.apache.abdera2:abdera2-client:jar:2.0-SNAPSHOT (compile)
[WARNING] o org.apache.abdera2:abdera2-security:jar:2.0-SNAPSHOT (compile)
[WARNING] o org.apache.abdera2:abdera2-activities:jar:2.0-SNAPSHOT (compile)
[WARNING] o org.apache.abdera2:abdera2-ext:jar:2.0-SNAPSHOT (compile)
[WARNING] Try running the build up to the lifecycle phase "package"
[INFO] 
[INFO] --- sonar-maven-plugin:2.0-beta-2:sonar (default-cli) @ abdera2 ---
Downloading: http://repo1.maven.org/maven2/commons-io/commons-io/1.3/commons-io-1.3.jar
Downloaded: http://repo1.maven.org/maven2/commons-io/commons-io/1.3/commons-io-1.3.jar (82
KB at 314.1 KB/sec)
[INFO] ------------------------------------------------------------------------
[INFO] Reactor Summary:
[INFO] 
[INFO] Apache Abdera2 .................................... FAILURE [27.093s]
[INFO] Abdera2 Common Library ............................ SKIPPED
[INFO] Abdera2 Core ...................................... SKIPPED
[INFO] Abdera2 Server .................................... SKIPPED
[INFO] Abdera2 Client .................................... SKIPPED
[INFO] Abdera2 Activities ................................ SKIPPED
[INFO] Abdera2 Extensions ................................ SKIPPED
[INFO] Abdera2 Security .................................. SKIPPED
[INFO] Abdera2 Tests ..................................... SKIPPED
[INFO] ------------------------------------------------------------------------
[INFO] BUILD FAILURE
[INFO] ------------------------------------------------------------------------
[INFO] Total time: 34.210s
[INFO] Finished at: Sun Sep 25 18:33:56 GMT+00:00 2011
[INFO] Final Memory: 11M/724M
[INFO] ------------------------------------------------------------------------
[ERROR] Failed to execute goal org.codehaus.mojo:sonar-maven-plugin:2.0-beta-2:sonar (default-cli)
on project abdera2: Sonar server can not be reached at http://sonar.zitting.name. Please check
the parameter 'sonar.host.url'. -> [Help 1]
org.apache.maven.lifecycle.LifecycleExecutionException: Failed to execute goal org.codehaus.mojo:sonar-maven-plugin:2.0-beta-2:sonar
(default-cli) on project abdera2: Sonar server can not be reached at http://sonar.zitting.name.
Please check the parameter 'sonar.host.url'.
	at org.apache.maven.lifecycle.internal.MojoExecutor.execute(MojoExecutor.java:217)
	at org.apache.maven.lifecycle.internal.MojoExecutor.execute(MojoExecutor.java:153)
	at org.apache.maven.lifecycle.internal.MojoExecutor.execute(MojoExecutor.java:145)
	at org.apache.maven.lifecycle.internal.LifecycleModuleBuilder.buildProject(LifecycleModuleBuilder.java:84)
	at org.apache.maven.lifecycle.internal.LifecycleModuleBuilder.buildProject(LifecycleModuleBuilder.java:59)
	at org.apache.maven.lifecycle.internal.LifecycleStarter.singleThreadedBuild(LifecycleStarter.java:183)
	at org.apache.maven.lifecycle.internal.LifecycleStarter.execute(LifecycleStarter.java:161)
	at org.apache.maven.DefaultMaven.doExecute(DefaultMaven.java:319)
	at org.apache.maven.DefaultMaven.execute(DefaultMaven.java:156)
	at org.apache.maven.cli.MavenCli.execute(MavenCli.java:537)
	at org.apache.maven.cli.MavenCli.doMain(MavenCli.java:196)
	at org.apache.maven.cli.MavenCli.main(MavenCli.java:141)
	at sun.reflect.NativeMethodAccessorImpl.invoke0(Native Method)
	at sun.reflect.NativeMethodAccessorImpl.invoke(NativeMethodAccessorImpl.java:39)
	at sun.reflect.DelegatingMethodAccessorImpl.invoke(DelegatingMethodAccessorImpl.java:25)
	at java.lang.reflect.Method.invoke(Method.java:597)
	at org.codehaus.plexus.classworlds.launcher.Launcher.launchEnhanced(Launcher.java:290)
	at org.codehaus.plexus.classworlds.launcher.Launcher.launch(Launcher.java:230)
	at org.codehaus.plexus.classworlds.launcher.Launcher.mainWithExitCode(Launcher.java:409)
	at org.codehaus.plexus.classworlds.launcher.Launcher.main(Launcher.java:352)
Caused by: org.apache.maven.plugin.MojoExecutionException: Sonar server can not be reached
at http://sonar.zitting.name. Please check the parameter 'sonar.host.url'.
	at org.codehaus.mojo.sonar.ServerMetadata.logSettings(ServerMetadata.java:82)
	at org.codehaus.mojo.sonar.SonarMojo.execute(SonarMojo.java:86)
	at org.apache.maven.plugin.DefaultBuildPluginManager.executeMojo(DefaultBuildPluginManager.java:101)
	at org.apache.maven.lifecycle.internal.MojoExecutor.execute(MojoExecutor.java:209)
	... 19 more
[ERROR] 
[ERROR] Re-run Maven using the -X switch to enable full debug logging.
[ERROR] 
[ERROR] For more information about the errors and possible solutions, please read the following
articles:
[ERROR] [Help 1] http://cwiki.apache.org/confluence/display/MAVEN/MojoExecutionException
Build step 'Sonar' marked build as failure


Mime
View raw message