abdera-dev mailing list archives

Site index · List index
Message view « Date » · « Thread »
Top « Date » · « Thread »
From Apache Jenkins Server <jenk...@builds.apache.org>
Subject Build failed in Jenkins: Abdera2-trunk » Abdera2 Core #4
Date Mon, 26 Sep 2011 05:02:16 GMT
See <https://builds.apache.org/job/Abdera2-trunk/org.apache.abdera2$abdera2-core/4/>

------------------------------------------
ignoring exception during new ExecutedMojo null
[INFO] 
[INFO] --- maven-source-plugin:2.1.2:jar (attach-sources) @ abdera2-common ---
[INFO] META-INF already added, skipping
[INFO] META-INF/LICENSE already added, skipping
[INFO] META-INF/NOTICE already added, skipping
[INFO] Building jar: /home/jenkins/jenkins-slave/workspace/Abdera2-trunk/abdera2/common/target/abdera2-common-2.0-SNAPSHOT-sources.jar
[INFO] META-INF already added, skipping
[INFO] META-INF/LICENSE already added, skipping
[INFO] META-INF/NOTICE already added, skipping
[INFO] [INFO] Installing /home/jenkins/jenkins-slave/workspace/Abdera2-trunk/abdera2/common/target/abdera2-common-2.0-SNAPSHOT.jar
to /home/jenkins/.m2/repository/org/apache/abdera2/abdera2-common/2.0-SNAPSHOT/abdera2-common-2.0-SNAPSHOT.jar
[INFO] Installing /home/jenkins/jenkins-slave/workspace/Abdera2-trunk/abdera2/common/pom.xml
to /home/jenkins/.m2/repository/org/apache/abdera2/abdera2-common/2.0-SNAPSHOT/abdera2-common-2.0-SNAPSHOT.pom
[INFO] Installing /home/jenkins/jenkins-slave/workspace/Abdera2-trunk/abdera2/common/target/abdera2-common-2.0-SNAPSHOT-sources.jar
to /home/jenkins/.m2/repository/org/apache/abdera2/abdera2-common/2.0-SNAPSHOT/abdera2-common-2.0-SNAPSHOT-sources.jar

[INFO] --- maven-install-plugin:2.3.1:install (default-install) @ abdera2-common ---
[INFO] 
[INFO] --- maven-bundle-plugin:2.1.0:install (default-install) @ abdera2-common ---
[INFO] Installing org/apache/abdera2/abdera2-common/2.0-SNAPSHOT/abdera2-common-2.0-SNAPSHOT.jar
[INFO] Writing OBR metadata
[JENKINS] Archiving /home/jenkins/jenkins-slave/workspace/Abdera2-trunk/abdera2/common/target/abdera2-common-2.0-SNAPSHOT-sources.jar
to /home/hudson/hudson/jobs/Abdera2-trunk/modules/org.apache.abdera2$abdera2-common/builds/2011-09-26_05-01-16/archive/org.apache.abdera2/abdera2-common/2.0-SNAPSHOT/abdera2-common-2.0-SNAPSHOT-sources.jar
[INFO] Downloading: http://repo1.maven.org/maven2/org/apache/maven/plugins/maven-install-plugin/maven-metadata.xml
                                                                        
[INFO] ------------------------------------------------------------------------
[INFO] Building Abdera2 Core 2.0-SNAPSHOT
[INFO] ------------------------------------------------------------------------
Downloaded: http://repo1.maven.org/maven2/org/apache/maven/plugins/maven-install-plugin/maven-metadata.xml
(503 B at 1.3 KB/sec)
Downloading: http://repo1.maven.org/maven2/org/apache/maven/plugins/maven-resources-plugin/maven-metadata.xml
Downloaded: http://repo1.maven.org/maven2/org/apache/maven/plugins/maven-resources-plugin/maven-metadata.xml
(657 B at 1.4 KB/sec)
Downloading: http://repo1.maven.org/maven2/org/apache/maven/plugins/maven-deploy-plugin/maven-metadata.xml
Downloaded: http://repo1.maven.org/maven2/org/apache/maven/plugins/maven-deploy-plugin/maven-metadata.xml
(614 B at 1.2 KB/sec)
[INFO] 
[INFO] --- maven-clean-plugin:2.4.1:clean (default-clean) @ abdera2-core ---
[INFO] 
[INFO] --- cobertura-maven-plugin:2.4:clean (default) @ abdera2-core ---
[INFO] 
[INFO] --- maven-bundle-plugin:2.1.0:cleanVersions (default) @ abdera2-core ---
[INFO] 
[INFO] --- maven-remote-resources-plugin:1.0:process (compile) @ abdera2-core ---
[INFO] [debug] execute contextualize
[INFO] Using 'UTF-8' encoding to copy filtered resources.
[INFO] Copying 3 resources
[INFO] Copying 2 resources

[INFO] --- maven-resources-plugin:2.5:resources (default-resources) @ abdera2-core ---
[INFO] 
[INFO] [INFO] Compiling 121 source files to <https://builds.apache.org/job/Abdera2-trunk/org.apache.abdera2$abdera2-core/ws/target/classes>
--- maven-compiler-plugin:2.3.2:compile (default-compile) @ abdera2-core ---
[INFO] -------------------------------------------------------------
[ERROR] COMPILATION ERROR : 
[INFO] -------------------------------------------------------------
[ERROR] <https://builds.apache.org/job/Abdera2-trunk/org.apache.abdera2$abdera2-core/ws/src/main/java/org/apache/abdera2/parser/axiom/FOMElement.java>:[201,32]
type parameters of <T>T cannot be determined; no unique maximal instance exists for
type variable T with upper bounds T,org.apache.abdera2.model.Element
[ERROR] <https://builds.apache.org/job/Abdera2-trunk/org.apache.abdera2$abdera2-core/ws/src/main/java/org/apache/abdera2/parser/axiom/FOMElement.java>:[233,32]
type parameters of <T>T cannot be determined; no unique maximal instance exists for
type variable T with upper bounds T,org.apache.abdera2.model.Element
[ERROR] <https://builds.apache.org/job/Abdera2-trunk/org.apache.abdera2$abdera2-core/ws/src/main/java/org/apache/abdera2/parser/axiom/FOMElement.java>:[372,32]
type parameters of <T>T cannot be determined; no unique maximal instance exists for
type variable T with upper bounds T,org.apache.abdera2.model.Element
[ERROR] <https://builds.apache.org/job/Abdera2-trunk/org.apache.abdera2$abdera2-core/ws/src/main/java/org/apache/abdera2/parser/axiom/FOMExtensibleElement.java>:[144,27]
type parameters of <T>T cannot be determined; no unique maximal instance exists for
type variable T with upper bounds T,org.apache.abdera2.model.Element
[ERROR] <https://builds.apache.org/job/Abdera2-trunk/org.apache.abdera2$abdera2-core/ws/src/main/java/org/apache/abdera2/parser/axiom/FOMExtensibleElement.java>:[223,25]
type parameters of <T>T cannot be determined; no unique maximal instance exists for
type variable T with upper bounds T,org.apache.abdera2.model.Element
[ERROR] <https://builds.apache.org/job/Abdera2-trunk/org.apache.abdera2$abdera2-core/ws/src/main/java/org/apache/abdera2/parser/axiom/FOMFactory.java>:[860,23]
type parameters of <T>T cannot be determined; no unique maximal instance exists for
type variable T with upper bounds T,org.apache.abdera2.model.Element
[ERROR] <https://builds.apache.org/job/Abdera2-trunk/org.apache.abdera2$abdera2-core/ws/src/main/java/org/apache/abdera2/parser/axiom/FOMFactory.java>:[867,23]
type parameters of <T>T cannot be determined; no unique maximal instance exists for
type variable T with upper bounds T,org.apache.abdera2.model.Element
[ERROR] <https://builds.apache.org/job/Abdera2-trunk/org.apache.abdera2$abdera2-core/ws/src/main/java/org/apache/abdera2/parser/axiom/FOMFactory.java>:[874,32]
type parameters of <T>T cannot be determined; no unique maximal instance exists for
type variable T with upper bounds T,org.apache.abdera2.model.Element
[ERROR] <https://builds.apache.org/job/Abdera2-trunk/org.apache.abdera2$abdera2-core/ws/src/main/java/org/apache/abdera2/parser/axiom/FOMFactory.java>:[882,32]
type parameters of <T>T cannot be determined; no unique maximal instance exists for
type variable T with upper bounds T,org.apache.abdera2.model.Element
[ERROR] <https://builds.apache.org/job/Abdera2-trunk/org.apache.abdera2$abdera2-core/ws/src/main/java/org/apache/abdera2/model/ElementIteratorWrapper.java>:[60,38]
type parameters of <T>T cannot be determined; no unique maximal instance exists for
type variable T with upper bounds T,org.apache.abdera2.model.Element
[INFO] 10 errors 
[INFO] -------------------------------------------------------------
[JENKINS] Archiving <https://builds.apache.org/job/Abdera2-trunk/org.apache.abdera2$abdera2-core/ws/pom.xml>
to /home/hudson/hudson/jobs/Abdera2-trunk/modules/org.apache.abdera2$abdera2-core/builds/2011-09-26_05-01-16/archive/org.apache.abdera2/abdera2-core/2.0-SNAPSHOT/abdera2-core-2.0-SNAPSHOT.pom


Mime
View raw message