abdera-dev mailing list archives

Site index · List index
Message view « Date » · « Thread »
Top « Date » · « Thread »
From Apache Jenkins Server <jenk...@builds.apache.org>
Subject Build failed in Jenkins: Abdera2-trunk #13
Date Tue, 27 Sep 2011 01:55:19 GMT
See <https://builds.apache.org/job/Abdera2-trunk/13/changes>

Changes:

[jmsnell] 

------------------------------------------
[...truncated 545 lines...]
[INFO] META-INF/NOTICE already added, skipping
[INFO] META-INF/LICENSE already added, skipping
[INFO] [INFO] Installing <https://builds.apache.org/job/Abdera2-trunk/ws/abdera2/ext/target/abdera2-ext-2.0-SNAPSHOT.jar>
to /home/jenkins/.m2/repository/org/apache/abdera2/abdera2-ext/2.0-SNAPSHOT/abdera2-ext-2.0-SNAPSHOT.jar
[INFO] Installing <https://builds.apache.org/job/Abdera2-trunk/ws/abdera2/ext/pom.xml>
to /home/jenkins/.m2/repository/org/apache/abdera2/abdera2-ext/2.0-SNAPSHOT/abdera2-ext-2.0-SNAPSHOT.pom
[INFO] Installing <https://builds.apache.org/job/Abdera2-trunk/ws/abdera2/ext/target/abdera2-ext-2.0-SNAPSHOT-sources.jar>
to /home/jenkins/.m2/repository/org/apache/abdera2/abdera2-ext/2.0-SNAPSHOT/abdera2-ext-2.0-SNAPSHOT-sources.jar

[INFO] --- maven-install-plugin:2.3.1:install (default-install) @ abdera2-ext ---
[INFO] 
[INFO] --- maven-bundle-plugin:2.1.0:install (default-install) @ abdera2-ext ---
[INFO] Installing org/apache/abdera2/abdera2-ext/2.0-SNAPSHOT/abdera2-ext-2.0-SNAPSHOT.jar
[INFO] Writing OBR metadata
[JENKINS] Archiving <https://builds.apache.org/job/Abdera2-trunk/ws/abdera2/ext/target/abdera2-ext-2.0-SNAPSHOT-sources.jar>
to /home/hudson/hudson/jobs/Abdera2-trunk/modules/org.apache.abdera2$abdera2-ext/builds/2011-09-27_01-50-24/archive/org.apache.abdera2/abdera2-ext/2.0-SNAPSHOT/abdera2-ext-2.0-SNAPSHOT-sources.jar
[INFO] Downloading: http://repo1.maven.org/maven2/org/apache/maven/plugins/maven-install-plugin/maven-metadata.xml
                                                                        
[INFO] ------------------------------------------------------------------------
[INFO] Building Abdera2 Security 2.0-SNAPSHOT
[INFO] ------------------------------------------------------------------------
Downloaded: http://repo1.maven.org/maven2/org/apache/maven/plugins/maven-install-plugin/maven-metadata.xml
(503 B at 1.4 KB/sec)
Downloading: http://repo1.maven.org/maven2/org/apache/maven/plugins/maven-resources-plugin/maven-metadata.xml
Downloaded: http://repo1.maven.org/maven2/org/apache/maven/plugins/maven-resources-plugin/maven-metadata.xml
(657 B at 1.3 KB/sec)
Downloading: http://repo1.maven.org/maven2/org/apache/maven/plugins/maven-deploy-plugin/maven-metadata.xml
Downloaded: http://repo1.maven.org/maven2/org/apache/maven/plugins/maven-deploy-plugin/maven-metadata.xml
(614 B at 1.2 KB/sec)
[INFO] 
[INFO] --- maven-clean-plugin:2.4.1:clean (default-clean) @ abdera2-security ---
[INFO] 
[INFO] --- cobertura-maven-plugin:2.4:clean (default) @ abdera2-security ---
[INFO] 
[INFO] --- maven-bundle-plugin:2.1.0:cleanVersions (default) @ abdera2-security ---
[INFO] 
[INFO] --- maven-remote-resources-plugin:1.0:process (compile) @ abdera2-security ---
[debug] execute contextualize
[INFO] [INFO] Using 'UTF-8' encoding to copy filtered resources.
[INFO] Copying 0 resource
[INFO] Copying 2 resources

[INFO] --- maven-resources-plugin:2.5:resources (default-resources) @ abdera2-security ---
[INFO] 
[INFO] --- maven-compiler-plugin:2.3.2:compile (default-compile) @ abdera2-security ---
[INFO] Compiling 24 source files to <https://builds.apache.org/job/Abdera2-trunk/ws/abdera2/security/target/classes>
[debug] execute contextualize
[INFO] [INFO] Using 'UTF-8' encoding to copy filtered resources.
[INFO] skip non existing resourceDirectory <https://builds.apache.org/job/Abdera2-trunk/ws/abdera2/security/src/test/resources>
[INFO] Copying 2 resources

[INFO] --- maven-resources-plugin:2.5:testResources (default-testResources) @ abdera2-security
---
[INFO] [INFO] No sources to compile

[INFO] --- maven-compiler-plugin:2.3.2:testCompile (default-testCompile) @ abdera2-security
---
[INFO] [INFO] Surefire report directory: <https://builds.apache.org/job/Abdera2-trunk/ws/abdera2/security/target/surefire-reports>

[INFO] --- maven-surefire-plugin:2.6:test (default-test) @ abdera2-security ---

-------------------------------------------------------
 T E S T S
-------------------------------------------------------
There are no tests to run.

Results :

Tests run: 0, Failures: 0, Errors: 0, Skipped: 0

[JENKINS] Recording test results
[INFO] 
[INFO] --- maven-bundle-plugin:2.1.0:bundle (default-bundle) @ abdera2-security ---
[WARNING] Warning building bundle org.apache.abdera2:abdera2-security:bundle:2.0-SNAPSHOT
: Instructions in Export-Package that are never used: org\.apache\.abdera\..*|org\.apache\.abdera
[WARNING] Warning building bundle org.apache.abdera2:abdera2-security:bundle:2.0-SNAPSHOT
: Superfluous export-package instructions: [org.apache.abdera.*]
[WARNING] Warning building bundle org.apache.abdera2:abdera2-security:bundle:2.0-SNAPSHOT
: Did not find matching referal for org.apache.abdera.*
[INFO] 
[INFO] --- maven-bundle-plugin:2.1.0:cleanVersions (default) @ abdera2-security ---
[JENKINS] Archiving <https://builds.apache.org/job/Abdera2-trunk/ws/abdera2/security/pom.xml>
to /home/hudson/hudson/jobs/Abdera2-trunk/modules/org.apache.abdera2$abdera2-security/builds/2011-09-27_01-50-24/archive/org.apache.abdera2/abdera2-security/2.0-SNAPSHOT/abdera2-security-2.0-SNAPSHOT.pom
[JENKINS] Archiving <https://builds.apache.org/job/Abdera2-trunk/ws/abdera2/security/target/abdera2-security-2.0-SNAPSHOT.jar>
to /home/hudson/hudson/jobs/Abdera2-trunk/modules/org.apache.abdera2$abdera2-security/builds/2011-09-27_01-50-24/archive/org.apache.abdera2/abdera2-security/2.0-SNAPSHOT/abdera2-security-2.0-SNAPSHOT.jar
ignoring exception during new ExecutedMojo null
[INFO] 
[INFO] --- maven-source-plugin:2.1.2:jar (attach-sources) @ abdera2-security ---
[INFO] META-INF already added, skipping
[INFO] META-INF/NOTICE already added, skipping
[INFO] META-INF/LICENSE already added, skipping
[INFO] Building jar: <https://builds.apache.org/job/Abdera2-trunk/ws/abdera2/security/target/abdera2-security-2.0-SNAPSHOT-sources.jar>
[INFO] META-INF already added, skipping
[INFO] META-INF/NOTICE already added, skipping
[INFO] META-INF/LICENSE already added, skipping
[INFO] [INFO] Installing <https://builds.apache.org/job/Abdera2-trunk/ws/abdera2/security/target/abdera2-security-2.0-SNAPSHOT.jar>
to /home/jenkins/.m2/repository/org/apache/abdera2/abdera2-security/2.0-SNAPSHOT/abdera2-security-2.0-SNAPSHOT.jar
[INFO] Installing <https://builds.apache.org/job/Abdera2-trunk/ws/abdera2/security/pom.xml>
to /home/jenkins/.m2/repository/org/apache/abdera2/abdera2-security/2.0-SNAPSHOT/abdera2-security-2.0-SNAPSHOT.pom
[INFO] Installing <https://builds.apache.org/job/Abdera2-trunk/ws/abdera2/security/target/abdera2-security-2.0-SNAPSHOT-sources.jar>
to /home/jenkins/.m2/repository/org/apache/abdera2/abdera2-security/2.0-SNAPSHOT/abdera2-security-2.0-SNAPSHOT-sources.jar

[INFO] --- maven-install-plugin:2.3.1:install (default-install) @ abdera2-security ---
[INFO] 
[INFO] --- maven-bundle-plugin:2.1.0:install (default-install) @ abdera2-security ---
[INFO] Installing org/apache/abdera2/abdera2-security/2.0-SNAPSHOT/abdera2-security-2.0-SNAPSHOT.jar
[INFO] Writing OBR metadata
[JENKINS] Archiving <https://builds.apache.org/job/Abdera2-trunk/ws/abdera2/security/target/abdera2-security-2.0-SNAPSHOT-sources.jar>
to /home/hudson/hudson/jobs/Abdera2-trunk/modules/org.apache.abdera2$abdera2-security/builds/2011-09-27_01-50-24/archive/org.apache.abdera2/abdera2-security/2.0-SNAPSHOT/abdera2-security-2.0-SNAPSHOT-sources.jar
[INFO] Downloading: http://repo1.maven.org/maven2/org/apache/maven/plugins/maven-install-plugin/maven-metadata.xml
                                                                        
[INFO] ------------------------------------------------------------------------
[INFO] Building Abdera2 Tests 2.0-SNAPSHOT
[INFO] ------------------------------------------------------------------------
Downloaded: http://repo1.maven.org/maven2/org/apache/maven/plugins/maven-install-plugin/maven-metadata.xml
(503 B at 1.4 KB/sec)
Downloading: http://repo1.maven.org/maven2/org/apache/maven/plugins/maven-resources-plugin/maven-metadata.xml
Downloaded: http://repo1.maven.org/maven2/org/apache/maven/plugins/maven-resources-plugin/maven-metadata.xml
(657 B at 1.3 KB/sec)
Downloading: http://repo1.maven.org/maven2/org/apache/maven/plugins/maven-deploy-plugin/maven-metadata.xml
Downloaded: http://repo1.maven.org/maven2/org/apache/maven/plugins/maven-deploy-plugin/maven-metadata.xml
(614 B at 1.2 KB/sec)
Downloading: http://download.java.net/maven/2/org/eclipse/jetty/jetty-server/8.0.0.v20110901/jetty-server-8.0.0.v20110901.pom
Downloading: http://repo1.maven.org/maven2/org/eclipse/jetty/jetty-server/8.0.0.v20110901/jetty-server-8.0.0.v20110901.pom
Downloaded: http://repo1.maven.org/maven2/org/eclipse/jetty/jetty-server/8.0.0.v20110901/jetty-server-8.0.0.v20110901.pom
(4 KB at 12.3 KB/sec)
Downloading: http://download.java.net/maven/2/org/eclipse/jetty/jetty-project/8.0.0.v20110901/jetty-project-8.0.0.v20110901.pom
Downloading: http://repo1.maven.org/maven2/org/eclipse/jetty/jetty-project/8.0.0.v20110901/jetty-project-8.0.0.v20110901.pom
Downloaded: http://repo1.maven.org/maven2/org/eclipse/jetty/jetty-project/8.0.0.v20110901/jetty-project-8.0.0.v20110901.pom
(22 KB at 54.1 KB/sec)
Downloading: http://download.java.net/maven/2/org/eclipse/jetty/jetty-parent/18/jetty-parent-18.pom
Downloading: http://repo1.maven.org/maven2/org/eclipse/jetty/jetty-parent/18/jetty-parent-18.pom
Downloaded: http://repo1.maven.org/maven2/org/eclipse/jetty/jetty-parent/18/jetty-parent-18.pom
(0 B at 0.0 KB/sec)
Downloading: http://download.java.net/maven/2/org/mortbay/jetty/servlet-api/3.0.20100224/servlet-api-3.0.20100224.pom
Downloading: http://repo1.maven.org/maven2/org/mortbay/jetty/servlet-api/3.0.20100224/servlet-api-3.0.20100224.pom
Downloaded: http://repo1.maven.org/maven2/org/mortbay/jetty/servlet-api/3.0.20100224/servlet-api-3.0.20100224.pom
(3 KB at 5.2 KB/sec)
Downloading: http://download.java.net/maven/2/org/eclipse/jetty/jetty-continuation/8.0.0.v20110901/jetty-continuation-8.0.0.v20110901.pom
Downloading: http://repo1.maven.org/maven2/org/eclipse/jetty/jetty-continuation/8.0.0.v20110901/jetty-continuation-8.0.0.v20110901.pom
Downloaded: http://repo1.maven.org/maven2/org/eclipse/jetty/jetty-continuation/8.0.0.v20110901/jetty-continuation-8.0.0.v20110901.pom
(3 KB at 8.1 KB/sec)
Downloading: http://download.java.net/maven/2/org/eclipse/jetty/jetty-http/8.0.0.v20110901/jetty-http-8.0.0.v20110901.pom
Downloading: http://repo1.maven.org/maven2/org/eclipse/jetty/jetty-http/8.0.0.v20110901/jetty-http-8.0.0.v20110901.pom
Downloaded: http://repo1.maven.org/maven2/org/eclipse/jetty/jetty-http/8.0.0.v20110901/jetty-http-8.0.0.v20110901.pom
(3 KB at 7.1 KB/sec)
Downloading: http://download.java.net/maven/2/org/eclipse/jetty/jetty-io/8.0.0.v20110901/jetty-io-8.0.0.v20110901.pom
Downloading: http://repo1.maven.org/maven2/org/eclipse/jetty/jetty-io/8.0.0.v20110901/jetty-io-8.0.0.v20110901.pom
Downloaded: http://repo1.maven.org/maven2/org/eclipse/jetty/jetty-io/8.0.0.v20110901/jetty-io-8.0.0.v20110901.pom
(3 KB at 6.0 KB/sec)
Downloading: http://download.java.net/maven/2/org/eclipse/jetty/jetty-util/8.0.0.v20110901/jetty-util-8.0.0.v20110901.pom
Downloading: http://repo1.maven.org/maven2/org/eclipse/jetty/jetty-util/8.0.0.v20110901/jetty-util-8.0.0.v20110901.pom
Downloaded: http://repo1.maven.org/maven2/org/eclipse/jetty/jetty-util/8.0.0.v20110901/jetty-util-8.0.0.v20110901.pom
(4 KB at 8.0 KB/sec)
Downloading: http://download.java.net/maven/2/org/eclipse/jetty/jetty-servlet/8.0.0.v20110901/jetty-servlet-8.0.0.v20110901.pom
Downloading: http://repo1.maven.org/maven2/org/eclipse/jetty/jetty-servlet/8.0.0.v20110901/jetty-servlet-8.0.0.v20110901.pom
Downloaded: http://repo1.maven.org/maven2/org/eclipse/jetty/jetty-servlet/8.0.0.v20110901/jetty-servlet-8.0.0.v20110901.pom
(3 KB at 6.9 KB/sec)
Downloading: http://download.java.net/maven/2/org/eclipse/jetty/jetty-security/8.0.0.v20110901/jetty-security-8.0.0.v20110901.pom
Downloading: http://repo1.maven.org/maven2/org/eclipse/jetty/jetty-security/8.0.0.v20110901/jetty-security-8.0.0.v20110901.pom
Downloaded: http://repo1.maven.org/maven2/org/eclipse/jetty/jetty-security/8.0.0.v20110901/jetty-security-8.0.0.v20110901.pom
(3 KB at 6.8 KB/sec)
Downloading: http://download.java.net/maven/2/org/eclipse/jetty/jetty-server/8.0.0.v20110901/jetty-server-8.0.0.v20110901.jar
Downloading: http://download.java.net/maven/2/org/mortbay/jetty/servlet-api/3.0.20100224/servlet-api-3.0.20100224.jar
Downloading: http://download.java.net/maven/2/org/eclipse/jetty/jetty-continuation/8.0.0.v20110901/jetty-continuation-8.0.0.v20110901.jar
Downloading: http://download.java.net/maven/2/org/eclipse/jetty/jetty-http/8.0.0.v20110901/jetty-http-8.0.0.v20110901.jar
Downloading: http://download.java.net/maven/2/org/eclipse/jetty/jetty-io/8.0.0.v20110901/jetty-io-8.0.0.v20110901.jar
Downloading: http://download.java.net/maven/2/org/eclipse/jetty/jetty-util/8.0.0.v20110901/jetty-util-8.0.0.v20110901.jar
Downloading: http://download.java.net/maven/2/org/eclipse/jetty/jetty-servlet/8.0.0.v20110901/jetty-servlet-8.0.0.v20110901.jar
Downloading: http://download.java.net/maven/2/org/eclipse/jetty/jetty-security/8.0.0.v20110901/jetty-security-8.0.0.v20110901.jar
Downloading: http://repo1.maven.org/maven2/org/eclipse/jetty/jetty-server/8.0.0.v20110901/jetty-server-8.0.0.v20110901.jar
Downloading: http://repo1.maven.org/maven2/org/mortbay/jetty/servlet-api/3.0.20100224/servlet-api-3.0.20100224.jar
Downloading: http://repo1.maven.org/maven2/org/eclipse/jetty/jetty-continuation/8.0.0.v20110901/jetty-continuation-8.0.0.v20110901.jar
Downloading: http://repo1.maven.org/maven2/org/eclipse/jetty/jetty-http/8.0.0.v20110901/jetty-http-8.0.0.v20110901.jar
Downloading: http://repo1.maven.org/maven2/org/eclipse/jetty/jetty-io/8.0.0.v20110901/jetty-io-8.0.0.v20110901.jar
Downloaded: http://repo1.maven.org/maven2/org/eclipse/jetty/jetty-server/8.0.0.v20110901/jetty-server-8.0.0.v20110901.jar
(317 KB at 242.0 KB/sec)
Downloading: http://repo1.maven.org/maven2/org/eclipse/jetty/jetty-util/8.0.0.v20110901/jetty-util-8.0.0.v20110901.jar
Downloaded: http://repo1.maven.org/maven2/org/eclipse/jetty/jetty-http/8.0.0.v20110901/jetty-http-8.0.0.v20110901.jar
(115 KB at 72.5 KB/sec)
Downloading: http://repo1.maven.org/maven2/org/eclipse/jetty/jetty-servlet/8.0.0.v20110901/jetty-servlet-8.0.0.v20110901.jar
Downloaded: http://repo1.maven.org/maven2/org/mortbay/jetty/servlet-api/3.0.20100224/servlet-api-3.0.20100224.jar
(206 KB at 113.7 KB/sec)
Downloading: http://repo1.maven.org/maven2/org/eclipse/jetty/jetty-security/8.0.0.v20110901/jetty-security-8.0.0.v20110901.jar
Downloaded: http://repo1.maven.org/maven2/org/eclipse/jetty/jetty-continuation/8.0.0.v20110901/jetty-continuation-8.0.0.v20110901.jar
(21 KB at 10.1 KB/sec)
Downloaded: http://repo1.maven.org/maven2/org/eclipse/jetty/jetty-io/8.0.0.v20110901/jetty-io-8.0.0.v20110901.jar
(96 KB at 41.4 KB/sec)
Downloaded: http://repo1.maven.org/maven2/org/eclipse/jetty/jetty-util/8.0.0.v20110901/jetty-util-8.0.0.v20110901.jar
(227 KB at 112.9 KB/sec)
Downloaded: http://repo1.maven.org/maven2/org/eclipse/jetty/jetty-servlet/8.0.0.v20110901/jetty-servlet-8.0.0.v20110901.jar
(89 KB at 38.5 KB/sec)
Downloaded: http://repo1.maven.org/maven2/org/eclipse/jetty/jetty-security/8.0.0.v20110901/jetty-security-8.0.0.v20110901.jar
(86 KB at 41.3 KB/sec)
[INFO] 
[INFO] --- maven-clean-plugin:2.4.1:clean (default-clean) @ abdera2-test ---
[INFO] 
[INFO] --- cobertura-maven-plugin:2.4:clean (default) @ abdera2-test ---
[INFO] 
[INFO] --- maven-bundle-plugin:2.1.0:cleanVersions (default) @ abdera2-test ---
[INFO] 
[INFO] --- maven-remote-resources-plugin:1.0:process (compile) @ abdera2-test ---
[debug] execute contextualize
[INFO] [INFO] Using 'UTF-8' encoding to copy filtered resources.
[INFO] Copying 28 resources

[INFO] --- maven-resources-plugin:2.5:resources (default-resources) @ abdera2-test ---
[INFO] Copying 2 resources
[INFO] 
[INFO] --- maven-compiler-plugin:2.3.2:compile (default-compile) @ abdera2-test ---
[INFO] Compiling 83 source files to <https://builds.apache.org/job/Abdera2-trunk/ws/abdera2/test/target/classes>
[INFO] -------------------------------------------------------------
[ERROR] COMPILATION ERROR : 
[INFO] -------------------------------------------------------------
[ERROR] <https://builds.apache.org/job/Abdera2-trunk/ws/abdera2/test/src/main/java/org/apache/abdera2/test/server/custom/CustomProvider.java>:[76,29]
type parameters of <S>S cannot be determined; no unique maximal instance exists for
type variable S with upper bounds S,org.apache.abdera2.common.protocol.ResponseContext
[INFO] 1 error
[INFO] -------------------------------------------------------------
[JENKINS] Archiving <https://builds.apache.org/job/Abdera2-trunk/ws/abdera2/test/pom.xml>
to /home/hudson/hudson/jobs/Abdera2-trunk/modules/org.apache.abdera2$abdera2-test/builds/2011-09-27_01-50-24/archive/org.apache.abdera2/abdera2-test/2.0-SNAPSHOT/abdera2-test-2.0-SNAPSHOT.pom
[INFO] ------------------------------------------------------------------------
[INFO] Reactor Summary:
[INFO] 
[INFO] Apache Abdera2 .................................... SUCCESS [36.741s]
[INFO] Abdera2 Common Library ............................ SUCCESS [52.947s]
[INFO] Abdera2 Core ...................................... SUCCESS [28.492s]
[INFO] Abdera2 Server .................................... SUCCESS [13.363s]
[INFO] Abdera2 Client .................................... SUCCESS [18.916s]
[INFO] Abdera2 Activities ................................ SUCCESS [26.811s]
[INFO] Abdera2 Extensions ................................ SUCCESS [15.628s]
[INFO] Abdera2 Security .................................. SUCCESS [12.887s]
[INFO] Abdera2 Tests ..................................... FAILURE [14.884s]
[INFO] ------------------------------------------------------------------------
[INFO] BUILD FAILURE
[INFO] ------------------------------------------------------------------------
[INFO] Total time: 4:31.975s
[INFO] Finished at: Tue Sep 27 01:55:12 UTC 2011
[INFO] Final Memory: 44M/726M
[INFO] ------------------------------------------------------------------------
Waiting for Jenkins to finish collecting data
mavenExecutionResult exceptions not empty
message : Failed to execute goal org.apache.maven.plugins:maven-compiler-plugin:2.3.2:compile
(default-compile) on project abdera2-test: Compilation failure
<https://builds.apache.org/job/Abdera2-trunk/ws/abdera2/test/src/main/java/org/apache/abdera2/test/server/custom/CustomProvider.java>:[76,29]
type parameters of <S>S cannot be determined; no unique maximal instance exists for
type variable S with upper bounds S,org.apache.abdera2.common.protocol.ResponseContext

cause : Compilation failure
<https://builds.apache.org/job/Abdera2-trunk/ws/abdera2/test/src/main/java/org/apache/abdera2/test/server/custom/CustomProvider.java>:[76,29]
type parameters of <S>S cannot be determined; no unique maximal instance exists for
type variable S with upper bounds S,org.apache.abdera2.common.protocol.ResponseContext

Stack trace : 
org.apache.maven.lifecycle.LifecycleExecutionException: Failed to execute goal org.apache.maven.plugins:maven-compiler-plugin:2.3.2:compile
(default-compile) on project abdera2-test: Compilation failure
<https://builds.apache.org/job/Abdera2-trunk/ws/abdera2/test/src/main/java/org/apache/abdera2/test/server/custom/CustomProvider.java>:[76,29]
type parameters of <S>S cannot be determined; no unique maximal instance exists for
type variable S with upper bounds S,org.apache.abdera2.common.protocol.ResponseContext

	at org.apache.maven.lifecycle.internal.MojoExecutor.execute(MojoExecutor.java:213)
	at org.apache.maven.lifecycle.internal.MojoExecutor.execute(MojoExecutor.java:153)
	at org.apache.maven.lifecycle.internal.MojoExecutor.execute(MojoExecutor.java:145)
	at org.apache.maven.lifecycle.internal.LifecycleModuleBuilder.buildProject(LifecycleModuleBuilder.java:84)
	at org.apache.maven.lifecycle.internal.LifecycleModuleBuilder.buildProject(LifecycleModuleBuilder.java:59)
	at org.apache.maven.lifecycle.internal.LifecycleStarter.singleThreadedBuild(LifecycleStarter.java:183)
	at org.apache.maven.lifecycle.internal.LifecycleStarter.execute(LifecycleStarter.java:161)
	at org.apache.maven.DefaultMaven.doExecute(DefaultMaven.java:319)
	at org.apache.maven.DefaultMaven.execute(DefaultMaven.java:156)
	at org.jvnet.hudson.maven3.launcher.Maven3Launcher.main(Maven3Launcher.java:79)
	at sun.reflect.NativeMethodAccessorImpl.invoke0(Native Method)
	at sun.reflect.NativeMethodAccessorImpl.invoke(NativeMethodAccessorImpl.java:39)
	at sun.reflect.DelegatingMethodAccessorImpl.invoke(DelegatingMethodAccessorImpl.java:25)
	at java.lang.reflect.Method.invoke(Method.java:597)
	at org.codehaus.plexus.classworlds.launcher.Launcher.launchStandard(Launcher.java:329)
	at org.codehaus.plexus.classworlds.launcher.Launcher.launch(Launcher.java:239)
	at org.jvnet.hudson.maven3.agent.Maven3Main.launch(Maven3Main.java:158)
	at hudson.maven.Maven3Builder.call(Maven3Builder.java:122)
	at hudson.maven.Maven3Builder.call(Maven3Builder.java:74)
	at hudson.remoting.UserRequest.perform(UserRequest.java:118)
	at hudson.remoting.UserRequest.perform(UserRequest.java:48)
	at hudson.remoting.Request$2.run(Request.java:287)
	at java.util.concurrent.Executors$RunnableAdapter.call(Executors.java:441)
	at java.util.concurrent.FutureTask$Sync.innerRun(FutureTask.java:303)
	at java.util.concurrent.FutureTask.run(FutureTask.java:138)
	at java.util.concurrent.ThreadPoolExecutor$Worker.runTask(ThreadPoolExecutor.java:886)
	at java.util.concurrent.ThreadPoolExecutor$Worker.run(ThreadPoolExecutor.java:908)
	at java.lang.Thread.run(Thread.java:619)
Caused by: org.apache.maven.plugin.CompilationFailureException: Compilation failure
<https://builds.apache.org/job/Abdera2-trunk/ws/abdera2/test/src/main/java/org/apache/abdera2/test/server/custom/CustomProvider.java>:[76,29]
type parameters of <S>S cannot be determined; no unique maximal instance exists for
type variable S with upper bounds S,org.apache.abdera2.common.protocol.ResponseContext

	at org.apache.maven.plugin.AbstractCompilerMojo.execute(AbstractCompilerMojo.java:656)
	at org.apache.maven.plugin.CompilerMojo.execute(CompilerMojo.java:128)
	at org.apache.maven.plugin.DefaultBuildPluginManager.executeMojo(DefaultBuildPluginManager.java:101)
	at org.apache.maven.lifecycle.internal.MojoExecutor.execute(MojoExecutor.java:209)
	... 27 more
Sending e-mails to: dev@abdera.apache.org
Sending e-mails to: dev@abdera.apache.org
channel stopped


Mime
View raw message