abdera-dev mailing list archives

Site index · List index
Message view « Date » · « Thread »
Top « Date » · « Thread »
From Apache Jenkins Server <jenk...@builds.apache.org>
Subject Build failed in Jenkins: Abdera2-trunk #4
Date Mon, 26 Sep 2011 05:02:17 GMT
See <https://builds.apache.org/job/Abdera2-trunk/4/changes>

Changes:

[jmsnell] 

------------------------------------------
[...truncated 1055 lines...]
A         examples/src/main/resources/org/apache/abdera/examples/appserver/README
AU        examples/src/main/resources/simple.xml
AU        examples/src/main/resources/test.xslt
AU        examples/src/main/resources/log4j.properties
AU        examples/src/main/resources/xmlcontent.xml
AU        examples/src/main/resources/key.jks
AU        examples/pom.xml
 U        .
At revision 1175670
Parsing POMs
[abdera2] $ /home/hudson/tools/java/latest1.6/bin/java -Xmx756m -Xms756m -XX:MaxPermSize=512m
-cp /home/jenkins/jenkins-slave/maven3-agent.jar:/home/hudson/tools/maven/latest3/boot/plexus-classworlds-2.4.jar
org.jvnet.hudson.maven3.agent.Maven3Main /home/hudson/tools/maven/latest3 /home/jenkins/jenkins-slave/slave.jar
/home/jenkins/jenkins-slave/maven3-interceptor.jar 41511
<===[JENKINS REMOTING CAPACITY]===>channel started
   Executing Maven:  -B -f <https://builds.apache.org/job/Abdera2-trunk/ws/abdera2/pom.xml>
clean install -U
[INFO] Scanning for projects...
[INFO] ------------------------------------------------------------------------
[INFO] Reactor Build Order:
[INFO] 
[INFO] Apache Abdera2
[INFO] Abdera2 Common Library
[INFO] Abdera2 Core
[INFO] Abdera2 Server
[INFO] Abdera2 Client
[INFO] Abdera2 Activities
[INFO] Abdera2 Extensions
[INFO] Abdera2 Security
[INFO] Abdera2 Tests
[INFO]                                                                         
[INFO] ------------------------------------------------------------------------
[INFO] Building Apache Abdera2 2.0-SNAPSHOT
[INFO] ------------------------------------------------------------------------
[INFO] 
[INFO] --- maven-clean-plugin:2.4.1:clean (default-clean) @ abdera2 ---
[INFO] 
[INFO] --- cobertura-maven-plugin:2.4:clean (default) @ abdera2 ---
[INFO] 
[INFO] --- maven-bundle-plugin:2.1.0:cleanVersions (default) @ abdera2 ---
[INFO] 
[INFO] --- maven-remote-resources-plugin:1.0:process (compile) @ abdera2 ---
[INFO] Setting property: classpath.resource.loader.class => 'org.codehaus.plexus.velocity.ContextClassLoaderResourceLoader'.
[INFO] Setting property: velocimacro.messages.on => 'false'.
[INFO] Setting property: resource.loader => 'classpath'.
[INFO] Setting property: resource.manager.logwhenfound => 'false'.
[INFO] 
[INFO] --- maven-bundle-plugin:2.1.0:cleanVersions (default) @ abdera2 ---
[JENKINS] Archiving <https://builds.apache.org/job/Abdera2-trunk/ws/abdera2/pom.xml>
to /home/hudson/hudson/jobs/Abdera2-trunk/modules/org.apache.abdera2$abdera2/builds/2011-09-26_05-01-16/archive/org.apache.abdera2/abdera2/2.0-SNAPSHOT/abdera2-2.0-SNAPSHOT.pom
ignoring exception during new ExecutedMojo null
[INFO] 
[INFO] --- maven-source-plugin:2.1.2:jar (attach-sources) @ abdera2 ---
[INFO] [INFO] Installing <https://builds.apache.org/job/Abdera2-trunk/ws/abdera2/pom.xml>
to /home/jenkins/.m2/repository/org/apache/abdera2/abdera2/2.0-SNAPSHOT/abdera2-2.0-SNAPSHOT.pom

[INFO] --- maven-install-plugin:2.3.1:install (default-install) @ abdera2 ---
[INFO]                                                                         
[INFO] ------------------------------------------------------------------------
[INFO] Building Abdera2 Common Library 2.0-SNAPSHOT
[INFO] ------------------------------------------------------------------------
Downloading: http://repo1.maven.org/maven2/org/apache/maven/plugins/maven-install-plugin/maven-metadata.xml
Downloaded: http://repo1.maven.org/maven2/org/apache/maven/plugins/maven-install-plugin/maven-metadata.xml
(503 B at 1.4 KB/sec)
Downloading: http://repo1.maven.org/maven2/org/apache/maven/plugins/maven-resources-plugin/maven-metadata.xml
Downloaded: http://repo1.maven.org/maven2/org/apache/maven/plugins/maven-resources-plugin/maven-metadata.xml
(657 B at 1.4 KB/sec)
Downloading: http://repo1.maven.org/maven2/org/apache/maven/plugins/maven-deploy-plugin/maven-metadata.xml
Downloaded: http://repo1.maven.org/maven2/org/apache/maven/plugins/maven-deploy-plugin/maven-metadata.xml
(614 B at 1.2 KB/sec)
Downloading: http://repo1.maven.org/maven2/org/apache/maven/plugins/maven-deploy-plugin/2.7/maven-deploy-plugin-2.7.pom
Downloaded: http://repo1.maven.org/maven2/org/apache/maven/plugins/maven-deploy-plugin/2.7/maven-deploy-plugin-2.7.pom
(6 KB at 11.2 KB/sec)
Downloading: http://repo1.maven.org/maven2/org/apache/maven/plugins/maven-deploy-plugin/2.7/maven-deploy-plugin-2.7.jar
Downloaded: http://repo1.maven.org/maven2/org/apache/maven/plugins/maven-deploy-plugin/2.7/maven-deploy-plugin-2.7.jar
(27 KB at 47.7 KB/sec)
Downloading: http://download.java.net/maven/2/javax/javaee-web-api/6.0/javaee-web-api-6.0.pom
Downloaded: http://download.java.net/maven/2/javax/javaee-web-api/6.0/javaee-web-api-6.0.pom
(4 KB at 3.2 KB/sec)
Downloading: http://download.java.net/maven/2/com/ibm/icu/icu4j/4.8.1.1/icu4j-4.8.1.1.pom
Downloading: http://repo1.maven.org/maven2/com/ibm/icu/icu4j/4.8.1.1/icu4j-4.8.1.1.pom
Downloaded: http://repo1.maven.org/maven2/com/ibm/icu/icu4j/4.8.1.1/icu4j-4.8.1.1.pom (5 KB
at 15.9 KB/sec)
Downloading: http://download.java.net/maven/2/javax/javaee-web-api/6.0/javaee-web-api-6.0.jar
Downloading: http://download.java.net/maven/2/com/ibm/icu/icu4j/4.8.1.1/icu4j-4.8.1.1.jar
Downloaded: http://download.java.net/maven/2/javax/javaee-web-api/6.0/javaee-web-api-6.0.jar
(909 KB at 844.4 KB/sec)
Downloading: http://repo1.maven.org/maven2/com/ibm/icu/icu4j/4.8.1.1/icu4j-4.8.1.1.jar
Downloaded: http://repo1.maven.org/maven2/com/ibm/icu/icu4j/4.8.1.1/icu4j-4.8.1.1.jar (7115
KB at 5584.7 KB/sec)
[INFO] 
[INFO] --- maven-clean-plugin:2.4.1:clean (default-clean) @ abdera2-common ---
[INFO] 
[INFO] --- cobertura-maven-plugin:2.4:clean (default) @ abdera2-common ---
[INFO] 
[INFO] --- maven-bundle-plugin:2.1.0:cleanVersions (default) @ abdera2-common ---
[INFO] 
[INFO] --- maven-remote-resources-plugin:1.0:process (compile) @ abdera2-common ---
[INFO] 
[INFO] --- maven-resources-plugin:2.5:resources (default-resources) @ abdera2-common ---
[debug] execute contextualize
[INFO] Using 'UTF-8' encoding to copy filtered resources.
[INFO] Copying 0 resource
[INFO] Copying 2 resources
[INFO] 
[INFO] --- maven-compiler-plugin:2.3.2:compile (default-compile) @ abdera2-common ---
[INFO] Compiling 167 source files to <https://builds.apache.org/job/Abdera2-trunk/ws/abdera2/common/target/classes>
[debug] execute contextualize
[INFO] [INFO] Using 'UTF-8' encoding to copy filtered resources.
[INFO] skip non existing resourceDirectory <https://builds.apache.org/job/Abdera2-trunk/ws/abdera2/common/src/test/resources>
[INFO] Copying 2 resources

[INFO] --- maven-resources-plugin:2.5:testResources (default-testResources) @ abdera2-common
---
[INFO] [INFO] No sources to compile

[INFO] --- maven-compiler-plugin:2.3.2:testCompile (default-testCompile) @ abdera2-common
---
[INFO] 
[INFO] Surefire report directory: <https://builds.apache.org/job/Abdera2-trunk/ws/abdera2/common/target/surefire-reports>

-------------------------------------------------------
 T E S T S
-------------------------------------------------------
There are no tests to run.
[INFO] 
Results :

Tests run: 0, Failures: 0, Errors: 0, Skipped: 0

--- maven-surefire-plugin:2.6:test (default-test) @ abdera2-common ---
[JENKINS] Recording test results
[INFO] 
[INFO] --- maven-bundle-plugin:2.1.0:bundle (default-bundle) @ abdera2-common ---
[WARNING] Warning building bundle org.apache.abdera2:abdera2-common:bundle:2.0-SNAPSHOT :
Instructions in Export-Package that are never used: org\.apache\.abdera\..*|org\.apache\.abdera
[WARNING] Warning building bundle org.apache.abdera2:abdera2-common:bundle:2.0-SNAPSHOT :
Superfluous export-package instructions: [org.apache.abdera.*]
[WARNING] Warning building bundle org.apache.abdera2:abdera2-common:bundle:2.0-SNAPSHOT :
Did not find matching referal for org.apache.abdera.*
[INFO] 
[INFO] --- maven-bundle-plugin:2.1.0:cleanVersions (default) @ abdera2-common ---
[JENKINS] Archiving <https://builds.apache.org/job/Abdera2-trunk/ws/abdera2/common/pom.xml>
to /home/hudson/hudson/jobs/Abdera2-trunk/modules/org.apache.abdera2$abdera2-common/builds/2011-09-26_05-01-16/archive/org.apache.abdera2/abdera2-common/2.0-SNAPSHOT/abdera2-common-2.0-SNAPSHOT.pom
[JENKINS] Archiving <https://builds.apache.org/job/Abdera2-trunk/ws/abdera2/common/target/abdera2-common-2.0-SNAPSHOT.jar>
to /home/hudson/hudson/jobs/Abdera2-trunk/modules/org.apache.abdera2$abdera2-common/builds/2011-09-26_05-01-16/archive/org.apache.abdera2/abdera2-common/2.0-SNAPSHOT/abdera2-common-2.0-SNAPSHOT.jar
ignoring exception during new ExecutedMojo null
[INFO] 
[INFO] --- maven-source-plugin:2.1.2:jar (attach-sources) @ abdera2-common ---
[INFO] META-INF already added, skipping
[INFO] META-INF/LICENSE already added, skipping
[INFO] META-INF/NOTICE already added, skipping
[INFO] Building jar: <https://builds.apache.org/job/Abdera2-trunk/ws/abdera2/common/target/abdera2-common-2.0-SNAPSHOT-sources.jar>
[INFO] META-INF already added, skipping
[INFO] META-INF/LICENSE already added, skipping
[INFO] META-INF/NOTICE already added, skipping
[INFO] [INFO] Installing <https://builds.apache.org/job/Abdera2-trunk/ws/abdera2/common/target/abdera2-common-2.0-SNAPSHOT.jar>
to /home/jenkins/.m2/repository/org/apache/abdera2/abdera2-common/2.0-SNAPSHOT/abdera2-common-2.0-SNAPSHOT.jar
[INFO] Installing <https://builds.apache.org/job/Abdera2-trunk/ws/abdera2/common/pom.xml>
to /home/jenkins/.m2/repository/org/apache/abdera2/abdera2-common/2.0-SNAPSHOT/abdera2-common-2.0-SNAPSHOT.pom
[INFO] Installing <https://builds.apache.org/job/Abdera2-trunk/ws/abdera2/common/target/abdera2-common-2.0-SNAPSHOT-sources.jar>
to /home/jenkins/.m2/repository/org/apache/abdera2/abdera2-common/2.0-SNAPSHOT/abdera2-common-2.0-SNAPSHOT-sources.jar

[INFO] --- maven-install-plugin:2.3.1:install (default-install) @ abdera2-common ---
[INFO] 
[INFO] --- maven-bundle-plugin:2.1.0:install (default-install) @ abdera2-common ---
[INFO] Installing org/apache/abdera2/abdera2-common/2.0-SNAPSHOT/abdera2-common-2.0-SNAPSHOT.jar
[INFO] Writing OBR metadata
[JENKINS] Archiving <https://builds.apache.org/job/Abdera2-trunk/ws/abdera2/common/target/abdera2-common-2.0-SNAPSHOT-sources.jar>
to /home/hudson/hudson/jobs/Abdera2-trunk/modules/org.apache.abdera2$abdera2-common/builds/2011-09-26_05-01-16/archive/org.apache.abdera2/abdera2-common/2.0-SNAPSHOT/abdera2-common-2.0-SNAPSHOT-sources.jar
[INFO] Downloading: http://repo1.maven.org/maven2/org/apache/maven/plugins/maven-install-plugin/maven-metadata.xml
                                                                        
[INFO] ------------------------------------------------------------------------
[INFO] Building Abdera2 Core 2.0-SNAPSHOT
[INFO] ------------------------------------------------------------------------
Downloaded: http://repo1.maven.org/maven2/org/apache/maven/plugins/maven-install-plugin/maven-metadata.xml
(503 B at 1.3 KB/sec)
Downloading: http://repo1.maven.org/maven2/org/apache/maven/plugins/maven-resources-plugin/maven-metadata.xml
Downloaded: http://repo1.maven.org/maven2/org/apache/maven/plugins/maven-resources-plugin/maven-metadata.xml
(657 B at 1.4 KB/sec)
Downloading: http://repo1.maven.org/maven2/org/apache/maven/plugins/maven-deploy-plugin/maven-metadata.xml
Downloaded: http://repo1.maven.org/maven2/org/apache/maven/plugins/maven-deploy-plugin/maven-metadata.xml
(614 B at 1.2 KB/sec)
[INFO] 
[INFO] --- maven-clean-plugin:2.4.1:clean (default-clean) @ abdera2-core ---
[INFO] 
[INFO] --- cobertura-maven-plugin:2.4:clean (default) @ abdera2-core ---
[INFO] 
[INFO] --- maven-bundle-plugin:2.1.0:cleanVersions (default) @ abdera2-core ---
[INFO] 
[INFO] --- maven-remote-resources-plugin:1.0:process (compile) @ abdera2-core ---
[INFO] [debug] execute contextualize
[INFO] Using 'UTF-8' encoding to copy filtered resources.
[INFO] Copying 3 resources
[INFO] Copying 2 resources

[INFO] --- maven-resources-plugin:2.5:resources (default-resources) @ abdera2-core ---
[INFO] 
[INFO] [INFO] Compiling 121 source files to <https://builds.apache.org/job/Abdera2-trunk/ws/abdera2/core/target/classes>
--- maven-compiler-plugin:2.3.2:compile (default-compile) @ abdera2-core ---
[INFO] -------------------------------------------------------------
[ERROR] COMPILATION ERROR : 
[INFO] -------------------------------------------------------------
[ERROR] <https://builds.apache.org/job/Abdera2-trunk/ws/abdera2/core/src/main/java/org/apache/abdera2/parser/axiom/FOMElement.java>:[201,32]
type parameters of <T>T cannot be determined; no unique maximal instance exists for
type variable T with upper bounds T,org.apache.abdera2.model.Element
[ERROR] <https://builds.apache.org/job/Abdera2-trunk/ws/abdera2/core/src/main/java/org/apache/abdera2/parser/axiom/FOMElement.java>:[233,32]
type parameters of <T>T cannot be determined; no unique maximal instance exists for
type variable T with upper bounds T,org.apache.abdera2.model.Element
[ERROR] <https://builds.apache.org/job/Abdera2-trunk/ws/abdera2/core/src/main/java/org/apache/abdera2/parser/axiom/FOMElement.java>:[372,32]
type parameters of <T>T cannot be determined; no unique maximal instance exists for
type variable T with upper bounds T,org.apache.abdera2.model.Element
[ERROR] <https://builds.apache.org/job/Abdera2-trunk/ws/abdera2/core/src/main/java/org/apache/abdera2/parser/axiom/FOMExtensibleElement.java>:[144,27]
type parameters of <T>T cannot be determined; no unique maximal instance exists for
type variable T with upper bounds T,org.apache.abdera2.model.Element
[ERROR] <https://builds.apache.org/job/Abdera2-trunk/ws/abdera2/core/src/main/java/org/apache/abdera2/parser/axiom/FOMExtensibleElement.java>:[223,25]
type parameters of <T>T cannot be determined; no unique maximal instance exists for
type variable T with upper bounds T,org.apache.abdera2.model.Element
[ERROR] <https://builds.apache.org/job/Abdera2-trunk/ws/abdera2/core/src/main/java/org/apache/abdera2/parser/axiom/FOMFactory.java>:[860,23]
type parameters of <T>T cannot be determined; no unique maximal instance exists for
type variable T with upper bounds T,org.apache.abdera2.model.Element
[ERROR] <https://builds.apache.org/job/Abdera2-trunk/ws/abdera2/core/src/main/java/org/apache/abdera2/parser/axiom/FOMFactory.java>:[867,23]
type parameters of <T>T cannot be determined; no unique maximal instance exists for
type variable T with upper bounds T,org.apache.abdera2.model.Element
[ERROR] <https://builds.apache.org/job/Abdera2-trunk/ws/abdera2/core/src/main/java/org/apache/abdera2/parser/axiom/FOMFactory.java>:[874,32]
type parameters of <T>T cannot be determined; no unique maximal instance exists for
type variable T with upper bounds T,org.apache.abdera2.model.Element
[ERROR] <https://builds.apache.org/job/Abdera2-trunk/ws/abdera2/core/src/main/java/org/apache/abdera2/parser/axiom/FOMFactory.java>:[882,32]
type parameters of <T>T cannot be determined; no unique maximal instance exists for
type variable T with upper bounds T,org.apache.abdera2.model.Element
[ERROR] <https://builds.apache.org/job/Abdera2-trunk/ws/abdera2/core/src/main/java/org/apache/abdera2/model/ElementIteratorWrapper.java>:[60,38]
type parameters of <T>T cannot be determined; no unique maximal instance exists for
type variable T with upper bounds T,org.apache.abdera2.model.Element
[INFO] 10 errors 
[INFO] -------------------------------------------------------------
[JENKINS] Archiving <https://builds.apache.org/job/Abdera2-trunk/ws/abdera2/core/pom.xml>
to /home/hudson/hudson/jobs/Abdera2-trunk/modules/org.apache.abdera2$abdera2-core/builds/2011-09-26_05-01-16/archive/org.apache.abdera2/abdera2-core/2.0-SNAPSHOT/abdera2-core-2.0-SNAPSHOT.pom
[INFO] ------------------------------------------------------------------------
[INFO] Reactor Summary:
[INFO] 
[INFO] Apache Abdera2 .................................... SUCCESS [11.400s]
[INFO] Abdera2 Common Library ............................ SUCCESS [24.921s]
[INFO] Abdera2 Core ...................................... FAILURE [4.484s]
[INFO] Abdera2 Server .................................... SKIPPED
[INFO] Abdera2 Client .................................... SKIPPED
[INFO] Abdera2 Activities ................................ SKIPPED
[INFO] Abdera2 Extensions ................................ SKIPPED
[INFO] Abdera2 Security .................................. SKIPPED
[INFO] Abdera2 Tests ..................................... SKIPPED
[INFO] ------------------------------------------------------------------------
[INFO] BUILD FAILURE
[INFO] ------------------------------------------------------------------------
[INFO] Total time: 44.306s
[INFO] Finished at: Mon Sep 26 05:02:16 UTC 2011
[INFO] Final Memory: 22M/724M
[INFO] ------------------------------------------------------------------------
Waiting for Jenkins to finish collecting data
mavenExecutionResult exceptions not empty
message : Failed to execute goal org.apache.maven.plugins:maven-compiler-plugin:2.3.2:compile
(default-compile) on project abdera2-core: Compilation failure
cause : Compilation failure
Stack trace : 
org.apache.maven.lifecycle.LifecycleExecutionException: Failed to execute goal org.apache.maven.plugins:maven-compiler-plugin:2.3.2:compile
(default-compile) on project abdera2-core: Compilation failure
	at org.apache.maven.lifecycle.internal.MojoExecutor.execute(MojoExecutor.java:213)
	at org.apache.maven.lifecycle.internal.MojoExecutor.execute(MojoExecutor.java:153)
	at org.apache.maven.lifecycle.internal.MojoExecutor.execute(MojoExecutor.java:145)
	at org.apache.maven.lifecycle.internal.LifecycleModuleBuilder.buildProject(LifecycleModuleBuilder.java:84)
	at org.apache.maven.lifecycle.internal.LifecycleModuleBuilder.buildProject(LifecycleModuleBuilder.java:59)
	at org.apache.maven.lifecycle.internal.LifecycleStarter.singleThreadedBuild(LifecycleStarter.java:183)
	at org.apache.maven.lifecycle.internal.LifecycleStarter.execute(LifecycleStarter.java:161)
	at org.apache.maven.DefaultMaven.doExecute(DefaultMaven.java:319)
	at org.apache.maven.DefaultMaven.execute(DefaultMaven.java:156)
	at org.jvnet.hudson.maven3.launcher.Maven3Launcher.main(Maven3Launcher.java:79)
	at sun.reflect.NativeMethodAccessorImpl.invoke0(Native Method)
	at sun.reflect.NativeMethodAccessorImpl.invoke(NativeMethodAccessorImpl.java:39)
	at sun.reflect.DelegatingMethodAccessorImpl.invoke(DelegatingMethodAccessorImpl.java:25)
	at java.lang.reflect.Method.invoke(Method.java:597)
	at org.codehaus.plexus.classworlds.launcher.Launcher.launchStandard(Launcher.java:329)
	at org.codehaus.plexus.classworlds.launcher.Launcher.launch(Launcher.java:239)
	at org.jvnet.hudson.maven3.agent.Maven3Main.launch(Maven3Main.java:158)
	at hudson.maven.Maven3Builder.call(Maven3Builder.java:122)
	at hudson.maven.Maven3Builder.call(Maven3Builder.java:74)
	at hudson.remoting.UserRequest.perform(UserRequest.java:118)
	at hudson.remoting.UserRequest.perform(UserRequest.java:48)
	at hudson.remoting.Request$2.run(Request.java:287)
	at java.util.concurrent.Executors$RunnableAdapter.call(Executors.java:441)
	at java.util.concurrent.FutureTask$Sync.innerRun(FutureTask.java:303)
	at java.util.concurrent.FutureTask.run(FutureTask.java:138)
	at java.util.concurrent.ThreadPoolExecutor$Worker.runTask(ThreadPoolExecutor.java:886)
	at java.util.concurrent.ThreadPoolExecutor$Worker.run(ThreadPoolExecutor.java:908)
	at java.lang.Thread.run(Thread.java:619)
Caused by: org.apache.maven.plugin.CompilationFailureException: Compilation failure
	at org.apache.maven.plugin.AbstractCompilerMojo.execute(AbstractCompilerMojo.java:656)
	at org.apache.maven.plugin.CompilerMojo.execute(CompilerMojo.java:128)
	at org.apache.maven.plugin.DefaultBuildPluginManager.executeMojo(DefaultBuildPluginManager.java:101)
	at org.apache.maven.lifecycle.internal.MojoExecutor.execute(MojoExecutor.java:209)
	... 27 more
Sending e-mails to: dev@abdera.apache.org
Sending e-mails to: dev@abdera.apache.org
channel stopped


Mime
View raw message