abdera-dev mailing list archives

Site index · List index
Message view « Date » · « Thread »
Top « Date » · « Thread »
From Apache Hudson Server <hud...@hudson.zones.apache.org>
Subject Build failed in Hudson: Abdera-trunk #100
Date Tue, 10 Aug 2010 00:04:56 GMT
See <http://hudson.zones.apache.org/hudson/job/Abdera-trunk/100/>

------------------------------------------
[...truncated 3118 lines...]
[INFO] Copying 2 resources
[INFO] [compiler:testCompile {execution: default-testCompile}]
[INFO] Compiling 1 source file to <http://hudson.zones.apache.org/hudson/job/Abdera-trunk/ws/trunk/extensions/rss/target/test-classes>
[INFO] [surefire:test {execution: default-test}]
[INFO] Surefire report directory: <http://hudson.zones.apache.org/hudson/job/Abdera-trunk/ws/trunk/extensions/rss/target/surefire-reports>

-------------------------------------------------------
 T E S T S
-------------------------------------------------------
Running org.apache.abdera.test.ext.rss.RssTest
Bob
Tests run: 1, Failures: 0, Errors: 0, Skipped: 0, Time elapsed: 0.461 sec

Results :

Tests run: 1, Failures: 0, Errors: 0, Skipped: 0

[HUDSON] Recording test results
[INFO] [bundle:bundle {execution: default-bundle}]
[INFO] Preparing source:jar
[WARNING] Removing: jar from forked lifecycle, to prevent recursive invocation.
[INFO] No goals needed for project - skipping
[INFO] [source:jar {execution: attach-sources}]
[INFO] Building jar: <http://hudson.zones.apache.org/hudson/job/Abdera-trunk/ws/trunk/extensions/rss/target/abdera-extensions-rss-1.1-SNAPSHOT-sources.jar>
[INFO] [install:install {execution: default-install}]
[INFO] Installing <http://hudson.zones.apache.org/hudson/job/Abdera-trunk/ws/trunk/extensions/rss/target/abdera-extensions-rss-1.1-SNAPSHOT.jar>
to /home/hudson/.m2/repository/org/apache/abdera/abdera-extensions-rss/1.1-SNAPSHOT/abdera-extensions-rss-1.1-SNAPSHOT.jar
[INFO] Installing <http://hudson.zones.apache.org/hudson/job/Abdera-trunk/ws/trunk/extensions/rss/target/abdera-extensions-rss-1.1-SNAPSHOT-sources.jar>
to /home/hudson/.m2/repository/org/apache/abdera/abdera-extensions-rss/1.1-SNAPSHOT/abdera-extensions-rss-1.1-SNAPSHOT-sources.jar
[INFO] [bundle:install {execution: default-install}]
[INFO] Parsing file:/home/hudson/.m2/repository/repository.xml
[Fatal Error] :-1:-1: Premature end of file.
org.xml.sax.SAXParseException: Premature end of file.
	at com.sun.org.apache.xerces.internal.parsers.DOMParser.parse(DOMParser.java:264)
	at com.sun.org.apache.xerces.internal.jaxp.DocumentBuilderImpl.parse(DocumentBuilderImpl.java:292)
	at javax.xml.parsers.DocumentBuilder.parse(DocumentBuilder.java:172)
	at org.apache.felix.obrplugin.ObrUpdate.parseFile(ObrUpdate.java:347)
	at org.apache.felix.obrplugin.ObrUpdate.parseRepositoryXml(ObrUpdate.java:324)
	at org.apache.felix.obrplugin.ObrInstall.execute(ObrInstall.java:140)
	at org.apache.maven.plugin.DefaultPluginManager.executeMojo(DefaultPluginManager.java:490)
	at hudson.maven.agent.PluginManagerInterceptor.executeMojo(PluginManagerInterceptor.java:182)
	at org.apache.maven.lifecycle.DefaultLifecycleExecutor.executeGoals(DefaultLifecycleExecutor.java:694)
	at org.apache.maven.lifecycle.DefaultLifecycleExecutor.executeGoalWithLifecycle(DefaultLifecycleExecutor.java:556)
	at org.apache.maven.lifecycle.DefaultLifecycleExecutor.executeGoal(DefaultLifecycleExecutor.java:535)
	at org.apache.maven.lifecycle.DefaultLifecycleExecutor.executeGoalAndHandleFailures(DefaultLifecycleExecutor.java:387)
	at org.apache.maven.lifecycle.DefaultLifecycleExecutor.executeTaskSegments(DefaultLifecycleExecutor.java:348)
	at org.apache.maven.lifecycle.DefaultLifecycleExecutor.execute(DefaultLifecycleExecutor.java:180)
	at org.apache.maven.lifecycle.LifecycleExecutorInterceptor.execute(LifecycleExecutorInterceptor.java:65)
	at org.apache.maven.DefaultMaven.doExecute(DefaultMaven.java:328)
	at org.apache.maven.DefaultMaven.execute(DefaultMaven.java:138)
	at org.apache.maven.cli.MavenCli.main(MavenCli.java:362)
	at sun.reflect.NativeMethodAccessorImpl.invoke0(Native Method)
	at sun.reflect.NativeMethodAccessorImpl.invoke(NativeMethodAccessorImpl.java:39)
	at sun.reflect.DelegatingMethodAccessorImpl.invoke(DelegatingMethodAccessorImpl.java:25)
	at java.lang.reflect.Method.invoke(Method.java:592)
	at org.codehaus.classworlds.Launcher.launchEnhanced(Launcher.java:315)
	at org.codehaus.classworlds.Launcher.launch(Launcher.java:255)
	at hudson.maven.agent.Main.launch(Main.java:165)
	at hudson.maven.MavenBuilder.call(MavenBuilder.java:165)
	at hudson.maven.MavenModuleSetBuild$Builder.call(MavenModuleSetBuild.java:708)
	at hudson.maven.MavenModuleSetBuild$Builder.call(MavenModuleSetBuild.java:652)
	at hudson.remoting.UserRequest.perform(UserRequest.java:114)
	at hudson.remoting.UserRequest.perform(UserRequest.java:48)
	at hudson.remoting.Request$2.run(Request.java:270)
	at java.util.concurrent.Executors$RunnableAdapter.call(Executors.java:417)
	at java.util.concurrent.FutureTask$Sync.innerRun(FutureTask.java:269)
	at java.util.concurrent.FutureTask.run(FutureTask.java:123)
	at java.util.concurrent.ThreadPoolExecutor$Worker.runTask(ThreadPoolExecutor.java:651)
	at java.util.concurrent.ThreadPoolExecutor$Worker.run(ThreadPoolExecutor.java:676)
	at java.lang.Thread.run(Thread.java:595)
[INFO] Writing OBR metadata
[HUDSON] Archiving <http://hudson.zones.apache.org/hudson/job/Abdera-trunk/ws/trunk/extensions/rss/pom.xml>
to /export/home/hudson/hudson/jobs/Abdera-trunk/modules/org.apache.abdera$abdera-extensions-rss/builds/2010-08-10_00-01-46/archive/org.apache.abdera/abdera-extensions-rss/1.1-SNAPSHOT/pom.xml
[HUDSON] Archiving <http://hudson.zones.apache.org/hudson/job/Abdera-trunk/ws/trunk/extensions/rss/target/abdera-extensions-rss-1.1-SNAPSHOT.jar>
to /export/home/hudson/hudson/jobs/Abdera-trunk/modules/org.apache.abdera$abdera-extensions-rss/builds/2010-08-10_00-01-46/archive/org.apache.abdera/abdera-extensions-rss/1.1-SNAPSHOT/abdera-extensions-rss-1.1-SNAPSHOT.jar
[HUDSON] Archiving <http://hudson.zones.apache.org/hudson/job/Abdera-trunk/ws/trunk/extensions/rss/target/abdera-extensions-rss-1.1-SNAPSHOT-sources.jar>
to /export/home/hudson/hudson/jobs/Abdera-trunk/modules/org.apache.abdera$abdera-extensions-rss/builds/2010-08-10_00-01-46/archive/org.apache.abdera/abdera-extensions-rss/1.1-SNAPSHOT/abdera-extensions-rss-1.1-SNAPSHOT-sources.jar
[INFO] ------------------------------------------------------------------------
[INFO] Building Abdera Extensions - Features
[INFO]    task-segment: [clean, install]
[INFO] ------------------------------------------------------------------------
[INFO] [clean:clean {execution: default-clean}]
[INFO] Deleting directory <http://hudson.zones.apache.org/hudson/job/Abdera-trunk/ws/trunk/extensions/features/target>
[INFO] [cobertura:clean {execution: default}]
[INFO] [remote-resources:process {execution: compile}]
[INFO] [resources:resources {execution: default-resources}]
[WARNING] Using platform encoding (UTF-8 actually) to copy filtered resources, i.e. build
is platform dependent!
[INFO] Copying 1 resource
[INFO] Copying 2 resources
[INFO] [compiler:compile {execution: default-compile}]
[INFO] Compiling 9 source files to <http://hudson.zones.apache.org/hudson/job/Abdera-trunk/ws/trunk/extensions/features/target/classes>
[INFO] [resources:testResources {execution: default-testResources}]
[WARNING] Using platform encoding (UTF-8 actually) to copy filtered resources, i.e. build
is platform dependent!
[INFO] Copying 0 resource
[INFO] Copying 2 resources
[INFO] [compiler:testCompile {execution: default-testCompile}]
[INFO] Compiling 2 source files to <http://hudson.zones.apache.org/hudson/job/Abdera-trunk/ws/trunk/extensions/features/target/test-classes>
[INFO] [surefire:test {execution: default-test}]
[INFO] Surefire report directory: <http://hudson.zones.apache.org/hudson/job/Abdera-trunk/ws/trunk/extensions/features/target/surefire-reports>

-------------------------------------------------------
 T E S T S
-------------------------------------------------------
Running org.apache.abdera.test.ext.features.FeatureTest
Tests run: 4, Failures: 0, Errors: 0, Skipped: 0, Time elapsed: 0.32 sec

Results :

Tests run: 4, Failures: 0, Errors: 0, Skipped: 0

[HUDSON] Recording test results
[INFO] [jar:jar {execution: default-jar}]
[INFO] Building jar: <http://hudson.zones.apache.org/hudson/job/Abdera-trunk/ws/trunk/extensions/features/target/abdera-extensions-features-1.1-SNAPSHOT.jar>
[INFO] Preparing source:jar
[WARNING] Removing: jar from forked lifecycle, to prevent recursive invocation.
[INFO] No goals needed for project - skipping
[INFO] [source:jar {execution: attach-sources}]
[INFO] Building jar: <http://hudson.zones.apache.org/hudson/job/Abdera-trunk/ws/trunk/extensions/features/target/abdera-extensions-features-1.1-SNAPSHOT-sources.jar>
[INFO] [install:install {execution: default-install}]
[INFO] Installing <http://hudson.zones.apache.org/hudson/job/Abdera-trunk/ws/trunk/extensions/features/target/abdera-extensions-features-1.1-SNAPSHOT.jar>
to /home/hudson/.m2/repository/org/apache/abdera/abdera-extensions-features/1.1-SNAPSHOT/abdera-extensions-features-1.1-SNAPSHOT.jar
[INFO] Installing <http://hudson.zones.apache.org/hudson/job/Abdera-trunk/ws/trunk/extensions/features/target/abdera-extensions-features-1.1-SNAPSHOT-sources.jar>
to /home/hudson/.m2/repository/org/apache/abdera/abdera-extensions-features/1.1-SNAPSHOT/abdera-extensions-features-1.1-SNAPSHOT-sources.jar
[HUDSON] Archiving <http://hudson.zones.apache.org/hudson/job/Abdera-trunk/ws/trunk/extensions/features/pom.xml>
to /export/home/hudson/hudson/jobs/Abdera-trunk/modules/org.apache.abdera$abdera-extensions-features/builds/2010-08-10_00-01-46/archive/org.apache.abdera/abdera-extensions-features/1.1-SNAPSHOT/pom.xml
[HUDSON] Archiving <http://hudson.zones.apache.org/hudson/job/Abdera-trunk/ws/trunk/extensions/features/target/abdera-extensions-features-1.1-SNAPSHOT.jar>
to /export/home/hudson/hudson/jobs/Abdera-trunk/modules/org.apache.abdera$abdera-extensions-features/builds/2010-08-10_00-01-46/archive/org.apache.abdera/abdera-extensions-features/1.1-SNAPSHOT/abdera-extensions-features-1.1-SNAPSHOT.jar
[HUDSON] Archiving <http://hudson.zones.apache.org/hudson/job/Abdera-trunk/ws/trunk/extensions/features/target/abdera-extensions-features-1.1-SNAPSHOT-sources.jar>
to /export/home/hudson/hudson/jobs/Abdera-trunk/modules/org.apache.abdera$abdera-extensions-features/builds/2010-08-10_00-01-46/archive/org.apache.abdera/abdera-extensions-features/1.1-SNAPSHOT/abdera-extensions-features-1.1-SNAPSHOT-sources.jar
[INFO] ------------------------------------------------------------------------
[INFO] Building Abdera Extensions
[INFO]    task-segment: [clean, install]
[INFO] ------------------------------------------------------------------------
[INFO] [clean:clean {execution: default-clean}]
[INFO] Deleting directory <http://hudson.zones.apache.org/hudson/job/Abdera-trunk/ws/trunk/extensions/target>
[INFO] [cobertura:clean {execution: default}]
[INFO] [remote-resources:process {execution: compile}]
[INFO] [site:attach-descriptor {execution: default-attach-descriptor}]
[INFO] Preparing source:jar
[WARNING] Removing: jar from forked lifecycle, to prevent recursive invocation.
[INFO] No goals needed for project - skipping
[INFO] [source:jar {execution: attach-sources}]
[INFO] [install:install {execution: default-install}]
[INFO] Installing <http://hudson.zones.apache.org/hudson/job/Abdera-trunk/ws/trunk/extensions/pom.xml>
to /home/hudson/.m2/repository/org/apache/abdera/abdera-extensions-parent/1.1-SNAPSHOT/abdera-extensions-parent-1.1-SNAPSHOT.pom
[HUDSON] Archiving <http://hudson.zones.apache.org/hudson/job/Abdera-trunk/ws/trunk/extensions/pom.xml>
to /export/home/hudson/hudson/jobs/Abdera-trunk/modules/org.apache.abdera$abdera-extensions-parent/builds/2010-08-10_00-01-46/archive/org.apache.abdera/abdera-extensions-parent/1.1-SNAPSHOT/pom.xml
[HUDSON] Archiving /home/hudson/.m2/repository/org/apache/abdera/abdera-extensions-parent/1.1-SNAPSHOT/abdera-extensions-parent-1.1-SNAPSHOT.pom
to /export/home/hudson/hudson/jobs/Abdera-trunk/modules/org.apache.abdera$abdera-extensions-parent/builds/2010-08-10_00-01-46/archive/org.apache.abdera/abdera-extensions-parent/1.1-SNAPSHOT/abdera-extensions-parent-1.1-SNAPSHOT.pom
[INFO] ------------------------------------------------------------------------
[INFO] Building Abdera Examples
[INFO]    task-segment: [clean, install]
[INFO] ------------------------------------------------------------------------
[INFO] [clean:clean {execution: default-clean}]
[INFO] Deleting directory <http://hudson.zones.apache.org/hudson/job/Abdera-trunk/ws/trunk/examples/target>
[INFO] [cobertura:clean {execution: default}]
[INFO] [remote-resources:process {execution: compile}]
[INFO] [resources:resources {execution: default-resources}]
[WARNING] Using platform encoding (UTF-8 actually) to copy filtered resources, i.e. build
is platform dependent!
[INFO] Copying 10 resources
[INFO] Copying 2 resources
[INFO] [compiler:compile {execution: default-compile}]
[INFO] Compiling 44 source files to <http://hudson.zones.apache.org/hudson/job/Abdera-trunk/ws/trunk/examples/target/classes>
[INFO] [resources:testResources {execution: default-testResources}]
[WARNING] Using platform encoding (UTF-8 actually) to copy filtered resources, i.e. build
is platform dependent!
[INFO] skip non existing resourceDirectory <http://hudson.zones.apache.org/hudson/job/Abdera-trunk/ws/trunk/examples/src/test/resources>
[INFO] Copying 2 resources
[INFO] [compiler:testCompile {execution: default-testCompile}]
[INFO] No sources to compile
[INFO] [surefire:test {execution: default-test}]
[INFO] Surefire report directory: <http://hudson.zones.apache.org/hudson/job/Abdera-trunk/ws/trunk/examples/target/surefire-reports>

-------------------------------------------------------
 T E S T S
-------------------------------------------------------
There are no tests to run.

Results :

Tests run: 0, Failures: 0, Errors: 0, Skipped: 0

[HUDSON] Recording test results
[INFO] [jar:jar {execution: default-jar}]
[INFO] Building jar: <http://hudson.zones.apache.org/hudson/job/Abdera-trunk/ws/trunk/examples/target/abdera-examples-1.1-SNAPSHOT.jar>
[INFO] Preparing source:jar
[WARNING] Removing: jar from forked lifecycle, to prevent recursive invocation.
[INFO] No goals needed for project - skipping
[INFO] [source:jar {execution: attach-sources}]
[INFO] Building jar: <http://hudson.zones.apache.org/hudson/job/Abdera-trunk/ws/trunk/examples/target/abdera-examples-1.1-SNAPSHOT-sources.jar>
[INFO] [install:install {execution: default-install}]
[INFO] Installing <http://hudson.zones.apache.org/hudson/job/Abdera-trunk/ws/trunk/examples/target/abdera-examples-1.1-SNAPSHOT.jar>
to /home/hudson/.m2/repository/org/apache/abdera/abdera-examples/1.1-SNAPSHOT/abdera-examples-1.1-SNAPSHOT.jar
[INFO] Installing <http://hudson.zones.apache.org/hudson/job/Abdera-trunk/ws/trunk/examples/target/abdera-examples-1.1-SNAPSHOT-sources.jar>
to /home/hudson/.m2/repository/org/apache/abdera/abdera-examples/1.1-SNAPSHOT/abdera-examples-1.1-SNAPSHOT-sources.jar
[HUDSON] Archiving <http://hudson.zones.apache.org/hudson/job/Abdera-trunk/ws/trunk/examples/pom.xml>
to /export/home/hudson/hudson/jobs/Abdera-trunk/modules/org.apache.abdera$abdera-examples/builds/2010-08-10_00-01-46/archive/org.apache.abdera/abdera-examples/1.1-SNAPSHOT/pom.xml
[HUDSON] Archiving <http://hudson.zones.apache.org/hudson/job/Abdera-trunk/ws/trunk/examples/target/abdera-examples-1.1-SNAPSHOT.jar>
to /export/home/hudson/hudson/jobs/Abdera-trunk/modules/org.apache.abdera$abdera-examples/builds/2010-08-10_00-01-46/archive/org.apache.abdera/abdera-examples/1.1-SNAPSHOT/abdera-examples-1.1-SNAPSHOT.jar
[HUDSON] Archiving <http://hudson.zones.apache.org/hudson/job/Abdera-trunk/ws/trunk/examples/target/abdera-examples-1.1-SNAPSHOT-sources.jar>
to /export/home/hudson/hudson/jobs/Abdera-trunk/modules/org.apache.abdera$abdera-examples/builds/2010-08-10_00-01-46/archive/org.apache.abdera/abdera-examples/1.1-SNAPSHOT/abdera-examples-1.1-SNAPSHOT-sources.jar
[INFO] 
[INFO] 
[INFO] ------------------------------------------------------------------------
[INFO] Reactor Summary:
[INFO] ------------------------------------------------------------------------
[INFO] Apache Abdera ......................................... SUCCESS [11.338s]
[INFO] I18N Libraries ........................................ SUCCESS [13.193s]
[INFO] Abdera Core ........................................... SUCCESS [5.802s]
[INFO] Abdera Parser ......................................... SUCCESS [6.978s]
[INFO] Abdera Client ......................................... SUCCESS [3.837s]
[INFO] Abdera Server ......................................... SUCCESS [6.242s]
[INFO] Abdera Spring Integration ............................. SUCCESS [3.479s]
[INFO] Abdera Adapters ....................................... SUCCESS [0.218s]
[INFO] Abdera JCR Adapter .................................... SUCCESS [7.500s]
[INFO] Abdera CouchDB Adapter ................................ SUCCESS [2.328s]
[INFO] Abdera Filesystem Adapter ............................. SUCCESS [1.851s]
[INFO] Abdera JDBC Adapter ................................... SUCCESS [1.123s]
[INFO] Abdera Security ....................................... SUCCESS [4.348s]
[INFO] Abdera Extensions - GData ............................. SUCCESS [0.995s]
[INFO] Abdera Extensions - Geo ............................... SUCCESS [1.173s]
[INFO] Abdera Extensions - HTML .............................. SUCCESS [1.257s]
[INFO] Abdera Extensions - Main .............................. SUCCESS [2.535s]
[INFO] Abdera Extensions - JSON .............................. SUCCESS [2.156s]
[INFO] Abdera Extensions - Media ............................. SUCCESS [2.745s]
[INFO] Abdera Extensions - OAuth ............................. SUCCESS [7.152s]
[INFO] Abdera Extensions - OpenSearch ........................ SUCCESS [4.198s]
[INFO] Abdera Extensions - Serializer ........................ SUCCESS [3.192s]
[INFO] Abdera Extensions - Sharing ........................... SUCCESS [2.465s]
[INFO] Abdera Extensions - WSSE .............................. SUCCESS [0.961s]
[INFO] Abdera Bundle Jar ..................................... SUCCESS [2.164s]
[INFO] Abdera Extensions - RSS ............................... SUCCESS [3.315s]
[INFO] Abdera Extensions - Features .......................... SUCCESS [2.570s]
[INFO] Abdera Extensions ..................................... SUCCESS [0.194s]
[INFO] Abdera Examples ....................................... SUCCESS [2.102s]
[INFO] ------------------------------------------------------------------------
[INFO] ------------------------------------------------------------------------
[INFO] BUILD SUCCESSFUL
[INFO] ------------------------------------------------------------------------
[INFO] Total time: 2 minutes 52 seconds
[INFO] Finished at: Tue Aug 10 00:04:48 UTC 2010
[INFO] Final Memory: 68M/727M
[INFO] ------------------------------------------------------------------------
channel stopped
Deploying artifacts to https://repository.apache.org/content/repositories/snapshots
Deploying the main artifact abdera-1.1-SNAPSHOT.pom
[INFO ] Retrieving previous build number from 
ERROR: Error deploying artifact: Failed to transfer file: https://repository.apache.org/content/repositories/snapshots/org/apache/abdera/abdera/1.1-SNAPSHOT/abdera-1.1-SNAPSHOT.pom.
Return code is: 401
org.apache.maven.artifact.deployer.ArtifactDeploymentException: Error deploying artifact:
Failed to transfer file: https://repository.apache.org/content/repositories/snapshots/org/apache/abdera/abdera/1.1-SNAPSHOT/abdera-1.1-SNAPSHOT.pom.
Return code is: 401
	at org.apache.maven.artifact.deployer.DefaultArtifactDeployer.deploy(DefaultArtifactDeployer.java:94)
	at hudson.maven.reporters.MavenArtifactRecord.deploy(MavenArtifactRecord.java:119)
	at hudson.maven.reporters.MavenAggregatedArtifactRecord.deploy(MavenAggregatedArtifactRecord.java:79)
	at hudson.maven.RedeployPublisher.perform(RedeployPublisher.java:109)
	at hudson.tasks.BuildStepMonitor$1.perform(BuildStepMonitor.java:19)
	at hudson.model.AbstractBuild$AbstractRunner.perform(AbstractBuild.java:601)
	at hudson.model.AbstractBuild$AbstractRunner.performAllBuildSteps(AbstractBuild.java:580)
	at hudson.maven.MavenModuleSetBuild$RunnerImpl.post2(MavenModuleSetBuild.java:610)
	at hudson.model.AbstractBuild$AbstractRunner.post(AbstractBuild.java:528)
	at hudson.model.Run.run(Run.java:1280)
	at hudson.maven.MavenModuleSetBuild.run(MavenModuleSetBuild.java:318)
	at hudson.model.ResourceController.execute(ResourceController.java:88)
	at hudson.model.Executor.run(Executor.java:127)
Caused by: org.apache.maven.wagon.TransferFailedException: Failed to transfer file: https://repository.apache.org/content/repositories/snapshots/org/apache/abdera/abdera/1.1-SNAPSHOT/abdera-1.1-SNAPSHOT.pom.
Return code is: 401
	at org.apache.maven.wagon.providers.http.LightweightHttpWagon.put(LightweightHttpWagon.java:172)
	at org.apache.maven.artifact.manager.DefaultWagonManager.putRemoteFile(DefaultWagonManager.java:244)
	at org.apache.maven.artifact.manager.DefaultWagonManager.putArtifact(DefaultWagonManager.java:160)
	at org.apache.maven.artifact.deployer.DefaultArtifactDeployer.deploy(DefaultArtifactDeployer.java:80)
	... 12 more


Mime
View raw message