abdera-dev mailing list archives

Site index · List index
Message view « Date » · « Thread »
Top « Date » · « Thread »
From Dan Diephouse <dan.diepho...@mulesource.com>
Subject Re: [MuleForge Bamboo] Apache Abdera - Trunk build 7 has FAILED (0 tests failed). Change made by jmsnell
Date Mon, 14 Jan 2008 17:42:51 GMT
Thats bizarre... Looking into it.

James M Snell wrote:
> Dan,
>
> The log shows the following error, which is not particularly helpful. 
> Looking over TestIO. I'm not that familiar with Surefire.  Would you 
> be able to take a look at figure out what it's complaining about?
>
> - James
>
> org.apache.maven.surefire.booter.SurefireExecutionException: Unable to 
> instantiate POJO 'class org.apache.abdera.i18n.test.iri.TestIO$1'; 
> nested exception is java.lang.IllegalAccessException: Class 
> org.apache.maven.surefire.testset.PojoTestSet can not access a member 
> of class org.apache.abdera.i18n.test.iri.TestIO$1 with modifiers ""; 
> nested exception is 
> org.apache.maven.surefire.testset.TestSetFailedException: Unable to 
> instantiate POJO 'class org.apache.abdera.i18n.test.iri.TestIO$1'; 
> nested exception is java.lang.IllegalAccessException: Class 
> org.apache.maven.surefire.testset.PojoTestSet can not access a member 
> of class org.apache.abdera.i18n.test.iri.TestIO$1 with modifiers ""
>
> MuleForge Bamboo CI Server wrote:
>> The project Apache Abdera - Trunk has the following 1 change by 1 
>> author:
>>
>> *jmsnell* made the following changes at
>> Comment:
>> Additional test cases and a couple of minor code changes
>>
>>> /incubator/abdera/java/trunk/dependencies/i18n/src/main/java/org/apache/abdera/i18n/text/Codepoint.java

>>> (611697)
>>> /incubator/abdera/java/trunk/dependencies/i18n/src/test/java/org/apache/abdera/i18n/test/iri/TestIO.java

>>> (611697)
>>> /incubator/abdera/java/trunk/dependencies/i18n/src/main/java/org/apache/abdera/i18n/text/Sanitizer.java

>>> (611697)
>>> /incubator/abdera/java/trunk/dependencies/i18n/src/test/java/org/apache/abdera/i18n/test/iri/TestSuite.java

>>> (611697)
>>> /incubator/abdera/java/trunk/dependencies/i18n/src/test/java/org/apache/abdera/i18n/test/iri/TestText.java

>>> (611697)
>>
>>
>>
>> ---------------------------------------------------------------------------------------

>>
>>
>> No failed tests found, a possible compilation error.
>>
>> Click http://bamboo.muleforge.org/browse/APACHEABDERA-TRUNK-7 to find 
>> out more.
>>
>> Thanks,
>>
>> Bamboo
>>


-- 
Dan Diephouse
MuleSource
http://mulesource.com | http://netzooid.com/blog


Mime
View raw message