abdera-dev mailing list archives

Site index · List index
Message view « Date » · « Thread »
Top « Date » · « Thread »
From James M Snell <jasn...@gmail.com>
Subject Re: Build problem with trunk
Date Mon, 04 Dec 2006 16:56:39 GMT
I've been unable to duplicate these results.  If someone is able to
track it down I'll commit the patch.

- James

Dan Diephouse wrote:
> Hi All,
> Forgive me if I'm doing something stupid or have missed something on the
> dev
> list explaining a broken build, but I can't seem to get trunk to build. I
> get the follow errors:
> 
> Running org.apache.abdera.test.parser.stax.ParserTest
> Tests run: 3, Failures: 0, Errors: 1, Skipped: 0, Time elapsed: 0.54 sec
> <<<
> FAILURE!
> Running org.apache.abdera.test.parser.stax.FOMTest
> Tests run: 10, Failures: 0, Errors: 2, Skipped: 0, Time elapsed: 3.195 sec
> <<< FAILURE!
> Running org.apache.abdera.test.parser.stax.FeedParserTest
> Tests run: 5, Failures: 0, Errors: 0, Skipped: 0, Time elapsed: 0.07 sec
> Running org.apache.abdera.test.parser.stax.ConcurrencyTest
> Tests run: 1, Failures: 0, Errors: 0, Skipped: 0, Time elapsed: 1.182 sec
> Running org.apache.abdera.test.parser.stax.AtomConformanceTest
> Tests run: 8, Failures: 2, Errors: 0, Skipped: 0, Time elapsed: 44.163 sec
> <<< FAILURE!
> Running org.apache.abdera.test.parser.stax.FeedValidatorTest
> Tests run: 252, Failures: 0, Errors: 0, Skipped: 0, Time elapsed: 76.43 sec
> 
>> From the first failed test:
> 
> $ cat
> parser/target/surefire-reports/org.apache.abdera.test.parser.stax.ParserTest.txt
> 
> -------------------------------------------------------------------------------
> 
> Test set: org.apache.abdera.test.parser.stax.ParserTest
> -------------------------------------------------------------------------------
> 
> Tests run: 3, Failures: 0, Errors: 1, Skipped: 0, Time elapsed: 0.54 sec
> <<<
> FAILURE!
> testParseReader(org.apache.abdera.test.parser.stax.ParserTest)  Time
> elapsed: 0.12 sec  <<< ERROR!
> org.apache.abdera.parser.ParseException:
> org.apache.abdera.util.iri.IRISyntaxException:
> org.apache.abdera.util.io.InvalidCharacterException: Invalid Character 0x20
>        at org.apache.abdera.parser.stax.FOMParser.parse(FOMParser.java:135)
>        at org.apache.abdera.util.AbstractParser.parse(AbstractParser.java
> :90)
>        at org.apache.abdera.test.parser.stax.ParserTest.testParseReader(
> ParserTest.java:60)
> 
> Am I doing anything wrong here? Or is the build just temporarily b0rked?
> Thanks,
> - Dan

Mime
View raw message